{"text_format":"1","workbook":"xlsx","n_sheets":18,"sheets":["Accueil","Général","Rapport d'activités","Informations complémentaires","Aide-mémoire hébergement repas","Calendrier jours fériés","Attente","Calculs temps attente","Calculs choix indemnité","Divers","Hébergement","Repas","Garde","Stationnement","Choix","Jours fériés","TAUX","Calculs repas"],"not_rendered":{"charts":0,"images":17,"macros":1,"external_links":1,"defined_names":28,"comments":3,"pivot_tables":0},"unopened":[],"bounds":{"document_bytes":16777216,"sheet_cells":100000,"rows_first":2000,"rows_last":500,"rows_between":2000,"halvings":0,"cell_chars":16384,"cell_head_chars":4096},"cells_cut":0,"cells_raw":0,"read":"whole","date_system":"1900"}

{"sheet":"Accueil","index":0,"n_rows":0,"n_cols":0,"rows_kept":0,"cut":false,"hidden":false,"merged":[[15,0,15,3]]}

{"sheet":"Général","index":1,"n_rows":98,"n_cols":20,"rows_kept":98,"cut":false,"hidden":false,"merged":[[63,2,63,11],[64,2,64,5],[21,7,21,9],[66,2,66,11],[10,3,10,4],[19,3,19,9],[53,3,53,7],[56,4,56,7],[12,2,15,2],[2,2,2,4],[3,2,3,4],[4,2,4,4],[9,9,9,11],[7,3,7,4],[9,6,9,7],[1,6,1,9],[8,9,8,11],[2,6,2,9],[3,6,3,9],[4,6,4,9],[8,6,8,7],[100,2,100,11],[57,4,57,7],[73,4,73,7],[87,4,87,7],[91,2,91,3],[90,2,90,3],[80,2,80,10],[93,2,93,3],[88,2,89,3],[82,4,82,7],[84,4,84,7],[83,4,83,7],[92,2,92,3],[77,4,77,6],[72,4,72,7],[58,4,58,7]]}
[]
[null,null,null,"Nom du transporteur",null,null,"Responsable de la facturation",null,null,null,null,"Numéro de dossier"]
[]
[null,null,"Adresse",null,null,null,"Téléphone",null,null,null,null,"# facture"]
[]
[null,null,"Personne transportée"]
[null,null,"Nom","Prénom",null,null,"Préposés au transport"]
[null,null,null,null,null,null,"Nom",null,null,"Prénom"]
[null,null,"Coroner"]
[null,null,"Nom","Prénom"]
[]
[]
[null,null,"Date et heure du départ des installations, et date et heure de l'arrivée aux installations.",null,null,null,"Départ",null,null,null,null,"Arrivée"]
[null,null,null,null,null,"Date  ",null,null,null,null,"Date  "]
[null,null,null,null,null,null,{"$f":"IFERROR(CONCATENATE('Jours fériés'!E31,\" / \",'Jours fériés'!E32),\"\")","v":""},null,null,null,null,{"$f":"IFERROR(CONCATENATE( 'Jours fériés'!E34,\" / \",'Jours fériés'!E35),\"\")","v":""}]
[null,null,null,null,null,"Heure  ",null,null,null,null,"Heure  "]
[]
[]
[]
[null,null,"Transport","Détails",null,null,null,null,null,null,null,"Total"]
[]
[null,null,"Tarif de base",null,null,null,"Faites un choix:  ",null,null,null,null,{"$f":"IFERROR(VLOOKUP(H22,TAUX!B24:C29,2,FALSE),0)","v":0}]
[]
[null,null,"Temps d'attente",null,"En heure",null,"En centième","Taux",null,"Total"]
[null,null,null,"S / J",{"$f":"IFERROR(IF('Calculs choix indemnité'!F17=2,'Calculs temps attente'!F31+'Calculs temps attente'!F32,'Calculs temps attente'!B31+'Calculs temps attente'!B32),\"\")","v":""},null,{"$f":"IFERROR(IF('Calculs choix indemnité'!$F$17=1,'Calculs temps attente'!E31+'Calculs temps attente'!E32,IF('Calculs choix indemnité'!$F$17=2,'Calculs temps attente'!G31+'Calculs temps attente'!G32,)),\"\")","v":0},{"$f":"TAUX!$C$6","v":28.75},null,{"$f":"IFERROR(H25*G25,\"\")","v":0}]
[null,null,null,"S / N",{"$f":"IFERROR(IF('Calculs choix indemnité'!F17=2,'Calculs temps attente'!F37,'Calculs temps attente'!C37),\"\")","v":""},null,{"$f":"IFERROR(IF('Calculs choix indemnité'!$F$17=1,'Calculs temps attente'!E37,IF('Calculs choix indemnité'!$F$17=2,'Calculs temps attente'!G37,)),\"\")","v":0},{"$f":"TAUX!$C$7","v":35.5},null,0]
[null,null,null,"FDS / J",{"$f":"IFERROR(IF('Calculs choix indemnité'!F17=2,'Calculs temps attente'!F33+'Calculs temps attente'!F34,'Calculs temps attente'!B33+'Calculs temps attente'!B34),\"\")","v":""},null,{"$f":"IFERROR(IF('Calculs choix indemnité'!$F$17=1,'Calculs temps attente'!E33+'Calculs temps attente'!E34,IF('Calculs choix indemnité'!$F$17=2,'Calculs temps attente'!G33+'Calculs temps attente'!G34,)),\"\")","v":0},{"$f":"TAUX!$C$8","v":31.75},null,0]
[null,null,null,"FDS / N",{"$f":"IFERROR(IF('Calculs choix indemnité'!F17=2,'Calculs temps attente'!F38,'Calculs temps attente'!C38),\"\")","v":""},null,{"$f":"IFERROR(IF('Calculs choix indemnité'!$F$17=1,'Calculs temps attente'!E38,IF('Calculs choix indemnité'!$F$17=2,'Calculs temps attente'!G38,)),\"\")","v":0},{"$f":"TAUX!$C$9","v":38.5},null,0]
[null,null,null,"F / J",{"$f":"IFERROR(IF('Calculs choix indemnité'!F17=2,'Calculs temps attente'!F35+'Calculs temps attente'!F36,'Calculs temps attente'!B35+'Calculs temps attente'!B36),\"\")","v":""},null,{"$f":"IFERROR(IF('Calculs choix indemnité'!$F$17=1,'Calculs temps attente'!E35+'Calculs temps attente'!E36,IF('Calculs choix indemnité'!$F$17=2,'Calculs temps attente'!G35+'Calculs temps attente'!G36,)),\"\")","v":0},{"$f":"TAUX!$C$10","v":40},null,0]
[null,null,null,"F / N",{"$f":"IFERROR(IF('Calculs choix indemnité'!F17=2,'Calculs temps attente'!F39,'Calculs temps attente'!C39),\"\")","v":""},null,{"$f":"IFERROR(IF('Calculs choix indemnité'!$F$17=1,'Calculs temps attente'!E39,IF('Calculs choix indemnité'!F17=2,'Calculs temps attente'!G39,)),\"\")","v":0},{"$f":"TAUX!$C$11","v":48},null,0]
[null,null,null,null,{"$f":"IFERROR(E25+E26+E27+E28+E29+E30,\"\")","v":""},null,{"$f":"SUM(G25:G30)","v":0},null,null,{"$f":"SUM(J25:J30)","v":0},null,{"$f":"J31","v":0}]
[]
[null,null,"Temps d'attente",null,"En heure",null,"En centième","Taux",null,"Total"]
[null,null,null,"S / J",{"$f":"IFERROR(IF('Calculs choix indemnité'!F17=2,'Calculs temps attente'!F62+'Calculs temps attente'!F63,'Calculs temps attente'!B62+'Calculs temps attente'!B63),\"\")","v":""},null,{"$f":"IFERROR(IF('Calculs choix indemnité'!$F$17=1,'Calculs temps attente'!E62+'Calculs temps attente'!E63,IF('Calculs choix indemnité'!$F$17=2,'Calculs temps attente'!G62+'Calculs temps attente'!G63,)),\"\")","v":0},{"$f":"TAUX!$C$6","v":28.75},null,{"$f":"IFERROR(H34*G34,\"\")","v":0}]
[null,null,null,"S / N",{"$f":"IFERROR(IF('Calculs choix indemnité'!F17=2,'Calculs temps attente'!F68,'Calculs temps attente'!C68),\"\")","v":""},null,{"$f":"IFERROR(IF('Calculs choix indemnité'!$F$17=1,'Calculs temps attente'!E68,IF('Calculs choix indemnité'!$F$17=2,'Calculs temps attente'!G68,)),\"\")","v":0},{"$f":"TAUX!$C$7","v":35.5},null,0]
[null,null,null,"FDS / J",{"$f":"IFERROR(IF('Calculs choix indemnité'!F17=2,'Calculs temps attente'!F64+'Calculs temps attente'!F65,'Calculs temps attente'!B64+'Calculs temps attente'!B65),\"\")","v":""},null,{"$f":"IFERROR(IF('Calculs choix indemnité'!$F$17=1,'Calculs temps attente'!E64+'Calculs temps attente'!E65,IF('Calculs choix indemnité'!$F$17=2,'Calculs temps attente'!G64+'Calculs temps attente'!G65,)),\"\")","v":0},{"$f":"TAUX!$C$8","v":31.75},null,0]
[null,null,null,"FDS / N",{"$f":"IFERROR(IF('Calculs choix indemnité'!F17=2,'Calculs temps attente'!F69,'Calculs temps attente'!C69),\"\")","v":""},null,{"$f":"IFERROR(IF('Calculs choix indemnité'!$F$17=1,'Calculs temps attente'!E69,IF('Calculs choix indemnité'!$F$17=2,'Calculs temps attente'!G69,)),\"\")","v":0},{"$f":"TAUX!$C$9","v":38.5},null,0,null,null,null,null,null,null,null,null,null," "]
[null,null,null,"F / J",{"$f":"IFERROR(IF('Calculs choix indemnité'!F17=2,'Calculs temps attente'!F66+'Calculs temps attente'!F67,'Calculs temps attente'!B66+'Calculs temps attente'!B67),\"\")","v":""},null,{"$f":"IFERROR(IF('Calculs choix indemnité'!$F$17=1,'Calculs temps attente'!E66+'Calculs temps attente'!E67,IF('Calculs choix indemnité'!$F$17=2,'Calculs temps attente'!G66+'Calculs temps attente'!G67,)),\"\")","v":0},{"$f":"TAUX!$C$10","v":40},null,0]
[null,null,null,"F / N",{"$f":"IFERROR(IF('Calculs choix indemnité'!F17=2,'Calculs temps attente'!F70,'Calculs temps attente'!C70),\"\")","v":""},null,{"$f":"IFERROR(IF('Calculs choix indemnité'!$F$17=1,'Calculs temps attente'!E70,IF('Calculs choix indemnité'!F17=2,'Calculs temps attente'!G70,)),\"\")","v":0},{"$f":"TAUX!$C$11","v":48},null,0]
[null,null,null,null,{"$f":"IFERROR(E34+E35+E36+E37+E38+E39,\"\")","v":""},null,{"$f":"SUM(G34:G39)","v":0},null,null,{"$f":"SUM(J34:J39)","v":0},null,{"$f":"J40","v":0}]
[]
[null,null,"Temps d'attente",null,"En heure",null,"En centième","Taux",null,"Total"]
[null,null,null,"S / J",{"$f":"IFERROR(IF('Calculs choix indemnité'!F17=2,\n'Calculs temps attente'!F93+'Calculs temps attente'!F94,\n'Calculs temps attente'!B93+'Calculs temps attente'!B94),\"\")","v":""},null,{"$f":"IFERROR(IF('Calculs choix indemnité'!$F$17=1,'Calculs temps attente'!E93+'Calculs temps attente'!E94,IF('Calculs choix indemnité'!$F$17=2,'Calculs temps attente'!G93+'Calculs temps attente'!G94,)),\"\")","v":0},{"$f":"TAUX!$C$6","v":28.75},null,{"$f":"IFERROR(H43*G43,\"\")","v":0}]
[null,null,null,"S / N",{"$f":"IFERROR(IF('Calculs choix indemnité'!F17=2,'Calculs temps attente'!F99,'Calculs temps attente'!C99),\"\")","v":""},null,{"$f":"IFERROR(IF('Calculs choix indemnité'!$F$17=1,'Calculs temps attente'!E99,IF('Calculs choix indemnité'!$F$17=2,'Calculs temps attente'!G99,)),\"\")","v":0},{"$f":"TAUX!$C$7","v":35.5},null,0]
[null,null,null,"FDS / J",{"$f":"IFERROR(IF('Calculs choix indemnité'!F17=2,'Calculs temps attente'!F95+'Calculs temps attente'!F96,'Calculs temps attente'!B95+'Calculs temps attente'!B96),\"\")","v":""},null,{"$f":"IFERROR(IF('Calculs choix indemnité'!$F$17=1,'Calculs temps attente'!E95+'Calculs temps attente'!E96,IF('Calculs choix indemnité'!$F$17=2,'Calculs temps attente'!G95+'Calculs temps attente'!G96,)),\"\")","v":0},{"$f":"TAUX!$C$8","v":31.75},null,0]
[null,null,null,"FDS / N",{"$f":"IFERROR(IF('Calculs choix indemnité'!F17=2,'Calculs temps attente'!F100,'Calculs temps attente'!C100),\"\")","v":""},null,{"$f":"IFERROR(IF('Calculs choix indemnité'!$F$17=1,'Calculs temps attente'!E100,IF('Calculs choix indemnité'!$F$17=2,'Calculs temps attente'!G100,)),\"\")","v":0},{"$f":"TAUX!$C$9","v":38.5},null,0,null,null,null,null,null,null,null,null,null," "]
[null,null,null,"F / J",{"$f":"IFERROR(IF('Calculs choix indemnité'!F17=2,'Calculs temps attente'!F97+'Calculs temps attente'!F98,'Calculs temps attente'!B97+'Calculs temps attente'!B98), \"\")","v":""},null,{"$f":"IFERROR(IF('Calculs choix indemnité'!$F$17=1,'Calculs temps attente'!E97+'Calculs temps attente'!E98,IF('Calculs choix indemnité'!$F$17=2,'Calculs temps attente'!G97+'Calculs temps attente'!G98,)),\"\")","v":0},{"$f":"TAUX!$C$10","v":40},null,0]
[null,null,null,"F / N",{"$f":"IFERROR(IF('Calculs choix indemnité'!F17=2,'Calculs temps attente'!F101,'Calculs temps attente'!C101),\"\")","v":""},null,{"$f":"IFERROR(IF('Calculs choix indemnité'!$F$17=1,'Calculs temps attente'!E101,IF('Calculs choix indemnité'!F17=2,'Calculs temps attente'!G101,)),\"\")","v":0},{"$f":"TAUX!$C$11","v":48},null,0]
[null,null,null,null,{"$f":"IFERROR(E43+E44+E45+E46+E47+E48,\"\")","v":""},null,{"$f":"SUM(G43:G48)","v":0},null,null,{"$f":"SUM(J43:J48)","v":0},null,{"$f":"J49","v":0}]
[]
[null,null,null,null,null,null,null,null,null,"Total Transport",null,{"$f":"SUM(L22:L50)","v":0}]
[]
[]
[null,null,"Autres frais","Détails",null,null,null,null,null,"Tarifs",null,"Total"]
[]
[null,null,"Frais de garde",{"$f":"Garde!K29","v":0},null,null,null,null,null,{"$f":"TAUX!C36","v":65.75},null,{"$f":"D56*J56","v":0}]
[null,null,"Frais de visite",null,null,null,null,null,null,{"$f":"TAUX!C37","v":65.75},null,{"$f":"D57*J57","v":0}]
[null,null,"Nettoyage supplémentaire",null,null,null,null,null,null,{"$f":"TAUX!C38","v":44.75},null,{"$f":"D58*J58","v":0}]
[null,null,"Corps additionnel",null,null,null,null,null,null,{"$f":"TAUX!C39","v":122},null,{"$f":"D59*J59","v":0}]
[null,null,null,null,null,null,null,null,null,"Total Autres frais",null,{"$f":"SUM(L56:L59)","v":0}]
[]
[]
[]
[null,null,{"$f":"IFERROR(\"La durée du transport est de \"\n&'Calculs choix indemnité'!$A$11\n&IF('Calculs choix indemnité'!$A$10<'Calculs choix indemnité'!$A$12,\". Vous pouvez demander le remboursement des repas seulement.\",\nIF('Calculs choix indemnité'!$A$10>'Calculs choix indemnité'!$A$12,\"\")),\"\")","v":""}]
[null,null,"Pour les transports dont la durée est supérieure à 12 heures, le transport comprend-il un coucher ? Faites un choix dans la cellule bleue.",null,null,null,null,{"$f":"IF(G65=\"\",\"non\",G65)","v":"non"},null,{"$f":"IF(H65=\"oui\",1,2)","v":2},null,{"$f":"'Calculs choix indemnité'!A10","v":{"$error":"#VALUE!"}}]
[]
[null,null,"Veuillez cliquer sur le bouton Repas ou le bouton Stationnement pour en demander le remboursement."]
[]
[null,null,null,null,null,null,null,null,null,"Dépenses réelles",null,"Indemnité journalière"]
[null,null,null,"Repas:  ","Exclus les taxes et les pourboires.",null,null,null,null,{"$f":"IFERROR(Repas!M42,\"\")","v":0}]
[]
[null,null,null,"Hébergement:  ","Inclus la taxe sur l'hébergement seulement.",null,null,null,null,{"$f":"IFERROR(\nIF(OR('Calculs choix indemnité'!A10<'Calculs choix indemnité'!A12,J65=2),\n0,\nHébergement!F27),)","v":0}]
[null,null,null,null,{"$f":"IFERROR(IF(AND(L65>='Calculs choix indemnité'!A12,J65=2,G65=\"non\"),\"Veuillez choisir la ville de votre destination\",\"\"),\"\")","v":""}]
[null,null,null,"Indemnité journalière:  ",{"$f":"IFERROR(IF(L74<>0,\"Vous avez choisi de demander l'indemnité journalière.\",IF('Calculs choix indemnité'!A10<'Calculs choix indemnité'!A12,\"\",\"Vous avez choisi de demander le remboursement des dépenses réelles.\")),\"\")","v":""},null,null,null,null,null,null,{"$f":"IFERROR(IF(AND(Choix!C17=1,Choix!D21=\"Vous devez choisir Dépenses réelles\"),\n0,\nIF(Choix!C17=1,Choix!D21,0)),0)","v":0}]
[]
[null,null,null,"Stationnement:  ","Exclus les taxes.",null,null,null,null,{"$f":"Stationnement!D16","v":0},null,{"$f":"J76","v":0}]
[]
[null,null,null,"Autre 1:  ","Inscrivez les détails dans la section Commentaires.",null,null,null,null,null,null,{"$f":"H78","v":0}]
[null,null,null,null,null,null,null,"Total dépenses taxables",null,{"$f":"SUM(J70:K78)","v":0},null,{"$f":"IF(L74=0,0,L76+L74+L78)","v":0}]
[]
[null,null,null,null,null,null,null,null,null,null,null,"Coûts réels"]
[null,null,"Pourboires",null,null,null,null,null,null,null,null,{"$f":"IFERROR(Repas!M44,\"\")","v":0}]
[null,null,"Traversier"]
[null,null,"Péage"]
[null,null,"Autre 2"]
[null,null,null,null,null,null,null,null,null,"Total dépenses non taxables",null,{"$f":"SUM(L82:L85)","v":0}]
[]
[]
[null,null,"Ces numéros sont obligatoires si vous vous servez de cette feuille comme facture.",null,null,null,null,null,null,"Total Transport",null,{"$f":"L51","v":0}]
[null,null,null,null,null,null,null,null,null,"Total Autres frais",null,{"$f":"L60","v":0}]
[null,null,"Numéro de TPS du transporteur",null,null,null,null,null,null,"Total Dépenses taxables remboursables",null,{"$f":"IF(L74>0,Général!L79,Général!J79)","v":0}]
[null,null,null,null,null,null,null,null,null,"Sous-total",null,{"$f":"SUM(L89:L91)","v":0}]
[null,null,"Numéro de TVQ du transporteur",null,null,null,null,0.05,null,"TPS",null,{"$f":"L92*TAUX!C61","v":0}]
[null,null,null,null,null,null,null,9.9750000000000005E-2,null,"TVQ",null,{"$f":"L92*TAUX!C62","v":0}]
[null,null,null,null,null,null,null,null,null,"Sous-total des taxes",null,{"$f":"ROUNDUP(L93+L94,3)","v":0}]
[null,null,null,null,null,null,null,null,null,"Total des services facturables et des dépenses taxables remboursables",null,{"$f":"L89+L90+L91+L93+L94","v":0}]
[null,null,null,null,null,null,null,null,null,"Total Dépenses non taxables remboursables",null,{"$f":"L86","v":0}]
[null,null,null,null,null,null,null,null,null,"Total des services facturables et des dépenses remboursables",null,{"$f":"L96+L97","v":0}]

{"sheet":"Rapport d'activités","index":2,"n_rows":64,"n_cols":12,"rows_kept":64,"cut":false,"hidden":true,"merged":[[51,2,51,6],[39,8,39,9],[1,10,1,11],[4,1,4,4],[4,6,4,8],[4,10,4,11],[22,8,22,9],[10,4,10,6],[1,1,1,4],[2,1,2,4]]}
[]
[null,"Maison funéraire",null,null,null,null,null,null,null,null,"No dossier"]
[]
[]
[null,"Personne transportée",null,null,null,null,"Coroner",null,null,null,"Appel"]
[null,"Nom",null,null,"Prénom",null,"Nom",null,"Prénom",null,"Date","Heure"]
[]
[]
[]
[]
[null,null,null,null,"Préposés au transport"]
[null,null,"Départ des installations",null,"Nom",null,"Prénom"]
[null,"Date  ",null,null,null,null,null,null,null,null,{"$f":"IFERROR(CONCATENATE( 'Jours fériés'!E34,\" / \",'Jours fériés'!E35),\"\")","v":""}]
[null,"Heure  "]
[]
[]
[]
[null,"Morgue Québec","Morgue Montréal",null,"Hôpital",null,"Résidence privée",null,null,"Autre"]
[]
[null,"Détails:",null,null,null,null,"Ville: ____________________________________"]
[]
[]
[null,null,null,null,"Biens",null,null,null,"Remise du corps"]
[null,"Heure d'arrivée:",null,null,"Objets ","Boîte ",null,"Préposé au coroner"]
[null,"Heure de départ:",null,null,"Documents ","Sac ",null,"Agent de sécurité "]
[null,"Temps d'attente:",null,null,"Enveloppe 3 ","Autre ",null,"Policier "]
[null,null,null,null,null,null,null,"Coroner "]
[null,null,null,null,null,null,null,"Autre "]
[]
[null,null,null,null,"Signature: ______________________________",null,null,"Signature: ______________________________"]
[]
[]
[]
[null,"Morgue Québec","Morgue Montréal",null,"Hôpital",null,"Résidence privée",null,null,"Autre"]
[]
[null,"Détails:",null,null,null,null,"Ville:"]
[]
[]
[]
[null,null,null,null,"Biens",null,null,null,"Remise du corps"]
[null,"Heure d'arrivée:",null,null,"Objets ","Boîte ",null,"Préposé au coroner"]
[null,"Heure de départ:",null,null,"Documents ","Sac ",null,"Agent de sécurité "]
[null,"Temps d'attente:",null,null,"Enveloppe 3 ","Autre ",null,"Policier "]
[null,null,null,null,null,null,null,"Coroner "]
[null,null,null,null,null,null,null,"Autre "]
[]
[null,null,null,null,"Signature: ______________________________",null,null,"Signature: ______________________________"]
[]
[]
[]
[]
[null,null,"Arrivée aux installations"]
[]
[null,"Date  ",null,null,"Heure  "]
[]
[]
[]
[null,"Garde: Date: __________ Heure: __________  Date: __________ Heure: __________   Date: __________ Heure: __________"]
[null,"Corps additionnel(s):   Nom: ___________________________  Prénom: __________________________ No dossier: _______________"]
[null,"Nettoyage supplémentaire:  oui _____   non _____  Justification: ________________________________________"]
[null,"Visites: Date: _______  Heure: _______"]
[null,"  Nom: ____________________  Prénom: __________________ Fonction: __________________________ Signature: _____________________________________"]
[null,"Visites: Date: _______  Heure: _______"]
[null,"  Nom: ____________________  Prénom: __________________ Fonction: __________________________ Signature: _____________________________________"]

{"sheet":"Informations complémentaires","index":3,"n_rows":0,"n_cols":0,"rows_kept":0,"cut":false,"hidden":false,"merged":[]}

{"sheet":"Aide-mémoire hébergement repas","index":4,"n_rows":22,"n_cols":10,"rows_kept":22,"cut":false,"hidden":false,"merged":[[20,1,20,9],[2,0,2,10],[7,0,11,0],[13,0,19,0]]}
[]
[null,null,null,null,null,null,null,null,null,"Bureau du coroner"]
["AIDE MÉMOIRE DÉPENSES D'HÉBERGEMENT ET DE REPAS REMBOURSABLES"]
[]
[]
[null,"Durée du déplacement *",null,"Coucher",null,"Repas",null,"Preuve",null,"Indemnité journalière"]
[]
["SANS COUCHER"]
[null,"Moins de 12 heures",null,"N/A",null,"Remboursement des dépenses réelles en fonction des montants maximums prévus",null,"Factures originales",null,"N/A"]
[]
[null,"Plus de 12 heures sans coucher",null,"N/A",null,"Remboursement des dépenses réelles en fonction des montants maximums prévus",null,"Preuve de déplacement à destination","OU","50 % de l'indemnité journalière"]
[]
[]
["AVEC COUCHER"]
[null,"Entre 12 et 18 heures avec coucher",null,"Remboursement des dépenses réelles en fonction des montants maximums prévus",null,"Remboursement des dépenses réelles en fonction des montants maximums prévus",null,"Factures d'hébergement et de repas en fonction des maximums prévus + Dates et heures de départ et d'arrivée","OU","50 % de l'indemnité journalière"]
[]
[null,"Entre 18 et 24 avec coucher",null,"Remboursement des dépenses réelles en fonction des montants maximums prévus",null,"Remboursement des dépenses réelles en fonction des montants maximums prévus",null,"Factures d'hébergement et de repas en fonction des maximums prévus + Dates et heures de départ et d'arrivée","OU","100 % de l'indemnité journalière"]
[]
[null,"Plus de 24 heures avec coucher",null,"Remboursement des dépenses réelles en fonction des montants maximums prévus",null,"Remboursement des dépenses réelles en fonction des montants maximums prévus",null,"Factures d'hébergement et de repas en fonction des maximums prévus + Dates et heures de départ et d'arrivée","OU","100 % de l'indemnité journalière + les repas pris au-delà des 24 heures"]
[]
[null,"* Un déplacement débute au moment du départ des préposés au transport des installations du transporteur jusqu'au moment de leur retour aux installations du transporteur."]
[null,null,null,null,null,null,null,null,null,"2021-12-15"]

{"sheet":"Calendrier jours fériés","index":5,"n_rows":25,"n_cols":7,"rows_kept":25,"cut":false,"hidden":false,"merged":[[6,1,6,6],[8,1,8,2],[1,3,2,5]]}
[]
[]
[]
[]
[]
[]
[null,"Calendrier des jours fériés 2022 à 2025"]
[]
[null,"Événement",null,2022,2023,2024,2025]
[null,null,"Jour de l'An","samedi 1er janvier 2022","dimanche 1er janvier 2023","lundi 1er janvier 2024","mercredi 1er janvier 2025"]
[null,null,"Lendemain du jour de l'An","dimanche 2 janvier 2022","lundi 2 janvier 2023","mardi 2 janvier 2024","jeudi 2 janvier 2025"]
[null,null,"Vendredi saint","vendredi 15 avril 2022","vendredi 7 avril 2023","vendredi 29 mars 2024","vendredi 18 avril 2025"]
[null,null,"Lundi de Pâques","lundi 18 avril 2022","lundi 10 avril 2023","lundi 1er avril 2024","lundi 21 avril 2025"]
[null,null,"Journée internationale des Patriotes","lundi 23 mai 2022","lundi 22 mai 2023","lundi 20 mai 2024","lundi 19 mai 2025"]
[null,null,"Fête nationale du Québec","vendredi 24 juin 2022","samedi 24 juin 2023","lundi 24 juin 2024","mardii 24 juin 2025"]
[null,null,"Fête du Canada","vendredi 1er juillet 2022","samedi 1er juillet 2023","lundi 1er juillet 2024","mardi 1er juillet 2025"]
[null,null,"Fête du Travail","lundi 5 septembre 2022","lundi 4 septembre 2023","lundi 2 septembre 2024","lundi 1er septembre 2025"]
[null,null,"Fête de l'Action de grâces","lundi 10 octobre 2022","lundi 9 octobre 2023","lundi 14 octobre 2024","lundi 13 octobre 2025"]
[null,null,"Veille de Noël","samedi 24 décembre 2022","dimanche 24 décembre 2023","mardi 24 décembre 2024","mercredi 24 décembre 2025"]
[null,null,"Noël","dimanche 25 décembre 2022","lundi 25 décembre 2023","mercredi 25 décembre 2024","jeudi 25 décembre 2025"]
[null,null,"Lendemain de Noël","lundi 26 décembre 2022","mardi 26 décembre 2023","jeudi 26 décembre 2024","vendredi 26 décembre 2025"]
[null,null,"Veille du Jour de l'An","samedi 31 décembre 2022","dimanche 31 décembre 2023","mardi 31 décembre 2024","mercredi 31 décembre 2025"]
[]
[null,null,null,null,null,null,"Bureau du coroner décembre 2021"]
[null,"Les jours de fête sont ceux accordés aux employés du gouvernement du Québec."]

{"sheet":"Attente","index":6,"n_rows":50,"n_cols":10,"rows_kept":50,"cut":false,"hidden":true,"merged":[[50,1,55,9],[46,1,47,9],[44,1,44,9],[16,3,16,5],[25,3,25,5],[17,9,19,9],[26,9,28,9],[34,3,34,5],[35,9,37,9]]}
[]
[]
[null,null,null,null,null,null,null,null,null,{"$f":"Général!L3","v":0}]
[]
[]
[null,"Remplir les cellules jaunes seulement, au besoin."]
[null,"Utilisez le format aaaa-mm-jj pour les dates."]
[null,"   Exemple: 4 mars 2021: inscrivez 2021-03-04"]
[null,"Utilisez le format 24 heures."]
[null,"  Exemple: 8 h 30 le matin: inscrivez 8:30 Pour minuit et 10 minutes inscrivez 0:10"]
[]
[]
[]
[null,null,null,"Début",null,"Fin",null,"Heure de fin modifiée*",null,"Coûts remboursables"]
[]
[]
[null,"Lieu de l'attente 1:"]
[null,null,null,null,null,null,null,null,null,{"$f":"IF(OR(D21=\"\",F21=\"\"),\"Les heures doivent être inscrites\",\"\")","v":"Les heures doivent être inscrites"}]
[null,"Date:"]
[]
[null,"Heure:",null,null,null,null,null,{"$f":"IFERROR(IF('Calculs temps attente'!C16='Calculs temps attente'!C15,\"\",'Calculs temps attente'!C16),)","v":"00:00:00"},null,{"$f":"IFERROR(IF(OR(D21=\"\",F21=\"\"),\"\",'Calculs temps attente'!H40),0)","v":""}]
[]
[]
[]
[]
[null,"Lieu de l'attente 2:"]
[null,null,null,null,null,null,null,null,null,{"$f":"IF(OR(D30=\"\",F30=\"\"),\"Les heures doivent être inscrites\",\"\")","v":"Les heures doivent être inscrites"}]
[null,"Date:"]
[]
[null,"Heure:",null,null,null,null,null,{"$f":"IFERROR(IF('Calculs temps attente'!C47='Calculs temps attente'!C46,\"\",'Calculs temps attente'!C47),)","v":"00:00:00"},null,{"$f":"IFERROR(IF(OR(D30=\"\",F30=\"\"),\"\",'Calculs temps attente'!H71),0)","v":""}]
[]
[]
[]
[]
[null,"Lieu de l'attente 3:"]
[null,null,null,null,null,null,null,null,null,{"$f":"IF(OR(D39=\"\",F39=\"\"),\"Les heures doivent être inscrites\",\"\")","v":"Les heures doivent être inscrites"}]
[null,"Date:"]
[]
[null,"Heure:",null,null,null,null,null,{"$f":"IFERROR(IF('Calculs temps attente'!C78='Calculs temps attente'!C77,\"\",'Calculs temps attente'!C78),)","v":"00:00:00"},null,{"$f":"IFERROR(IF(OR(D39=\"\",F39=\"\"),\"\",'Calculs temps attente'!H102),0)","v":""}]
[]
[]
[]
[null,null,null,null,null,null,null,"Total",null,{"$f":"SUM(J21:J42)","v":0}]
[]
[null,"* Si le temps d'attente dépasse une durée de 9 h, l'heure de fin de l'attente est modifiée automatiquement pour tenir compte de ce maximum."]
[]
[null,"Si aucun total ne s'inscrit à droite ou que la cellule indique ####, \nmodifier les dates et/ou les heures ou le format des dates et/ou des heures."]
[]
[]
[null,"Commentaires:"]

{"sheet":"Calculs temps attente","index":7,"n_rows":111,"n_cols":16,"rows_kept":111,"cut":false,"hidden":true,"merged":[[81,9,81,10],[81,11,81,12],[6,19,6,20],[19,9,19,10],[19,11,19,12],[50,9,50,10],[50,11,50,12]]}
[null,null,"TEMPS D'ATTENTE"]
[]
[null,null,"Semaine / Jour_soir",{"$f":"TAUX!$C6","v":28.75},null,null,"NE RIEN MODIFIER DANS CE TABLEAU SOUS PEINE D'ÉLECTROCUTION"]
[null,null,"Semaine / Nuit",{"$f":"TAUX!$C7","v":35.5}]
["00:00:00",null,"Fin de semaine / Jour_soir",{"$f":"TAUX!$C8","v":31.75}]
["23:59:00",null,"Fin de semaine / Nuit",{"$f":"TAUX!$C9","v":38.5}]
[{"$f":"TEXT(A6,\"hh:mm\")","v":"23:59"},null,"Férié / Jour_soir",{"$f":"TAUX!$C10","v":40}]
[{"$f":"TEXT(A9,\"hh:mm\")","v":"08:00"},null,"Férié / Nuit",{"$f":"TAUX!$C11","v":48}]
["08:00:00"]
[1]
[null,null,null,null,null,null,"Attente 1"]
[]
[null,"Début","Fin"]
["Date début /  fin",{"$f":"Attente!D19","v":"00:00:00"},{"$f":"Attente!F19","v":"00:00:00"},{"$f":"TEXT(B14,\"aaaa-mm-jj \")&TEXT(B15,\"hh:mm\")","v":"1900-01-00 00:00"}]
["Heure début / fin",{"$f":"Attente!D21","v":"00:00:00"},{"$f":"TEXT(Attente!F21,\"hh:mm\")","v":"00:00"},{"$f":"TEXT(C14,\"aaaa-mm-jj \")&TEXT(C15,\"hh:mm\")","v":"1900-01-00 00:00"},null,{"$f":"IF(AND(B16>A8,B16<A7),B16,\"\")","v":""}]
["Heure modifiée",{"$f":"TEXT(B15,\"hh:mm\")","v":"00:00"},{"$f":"TEXT(IF(D16<K30,C15,B16+K30),\"hh:mm\")","v":{"$error":"#VALUE!"}},{"$f":"D15-D14","v":{"$error":"#VALUE!"}}]
[]
[]
[]
[null,null,null,null,{"$f":"IF(E22>=K30,\"Dépassement\",\"\")","v":"Dépassement"},null,{"$f":"IFERROR(IF(AND(B25=\"oui\",D15<K30),$A$10-C25,$A$10-C25),\"\")","v":""},{"$f":"TEXT(IFERROR(IF(AND(C16>$A$8,B25=\"oui\"),\n$A$8,E25-G25),\"\"),\"hh:mm\")","v":""},{"$f":"IFERROR(IF(AND(E25-G20-H20>0,B25=\"oui\"),IF(C16-$A$8>0,C16-$A$8,\"\")),)","v":"00:00:00"},"Semaine  ou FDS",null,"Férié ou ordinaire"]
[null,null,"Début","Fin","Durée totale",null,"Durée jour 1","Durée nuit","Durée jour 2","Jour 1","Jour 2","Jour 1","Jour 2"]
["Jour + Jour",{"$f":"IF(C14-B14=0,\n\"oui\",IF(AND(C14-B14=1,B16+K30<=A10),\n\"oui\",\n\"non\"))","v":"oui"},{"$f":"IF(AND(B16>=$A$8,\nB16<=$A$7,\nB22=\"oui\"),\nB16,\"\")","v":""},{"$f":"IF(C22<>\"\",C16,\"\")","v":""},{"$f":"IF(AND(D22=\"\",C22=\"\"),\"\",IF(D22=\"00:00\",A10-B16,D22-C22))","v":""},null,{"$f":"$E22","v":""},null,null,{"$f":"IFERROR(IF(VLOOKUP(B14,'Jours fériés'!$B$4:$E$1829,2,FALSE)=\"s\",\"S\",\"FDS\"),0)","v":0},null,{"$f":"IF(VLOOKUP(B14,'Jours fériés'!$B$4:$E$1829,3,FALSE)=\"Oui\",\"F\",\"\")","v":{"$error":"#N/A"}}]
["Nuit+ Nuit",{"$f":"IF(C14-B14=0,\"oui\",\"non\")","v":"oui"},{"$f":"IF(AND(B16>=$A$5,\nC16<=$A$8,\nB23=\"oui\"),\nB16,\"\")","v":{"$error":"#VALUE!"}},{"$f":"IF(C23<>\"\",C16,\"\")","v":{"$error":"#VALUE!"}},{"$f":"TEXT(IF(D23<>\"\",D23-C23,\"\"),\"hh:mm\")","v":{"$error":"#VALUE!"}},null,null,{"$f":"TEXT($E23,\"hh:mm\")","v":{"$error":"#VALUE!"}},null,{"$f":"IF(VLOOKUP(B14,'Jours fériés'!B4:$E$1829,2,FALSE)=\"s\",\"S\",\"FDS\")","v":{"$error":"#N/A"}},null,{"$f":"IF(VLOOKUP(B14,'Jours fériés'!$B$4:$E$1829,3,FALSE)=\"Oui\",\"F\",\"\")","v":{"$error":"#N/A"}}]
["Nuit + Jour",{"$f":"IF(C14-B14=0,\"oui\",\"non\")","v":"oui"},{"$f":"IF(AND(B16>=$A$5,\nB16<A8,\nC16>$A$8,\nB24=\"oui\"),\nB16,\"\")","v":{"$error":"#VALUE!"}},{"$f":"IF(C24<>\"\",C16,\"\")","v":{"$error":"#VALUE!"}},{"$f":"TEXT(IF(D24<>\"\",D24-C24,\"\"),\"hh:mm\")","v":{"$error":"#VALUE!"}},null,null,{"$f":"TEXT(IF(D24<>\"\",$A$8-C24,\"\"),\"hh:mm\")","v":{"$error":"#VALUE!"}},{"$f":"IF(E24<>\"\",D24-$A$8,\"\")","v":{"$error":"#VALUE!"}},{"$f":"IF(VLOOKUP(B14,'Jours fériés'!$B$4:$E$1829,2,FALSE)=\"s\",\"S\",\"FDS\")","v":{"$error":"#N/A"}},{"$f":"IF(VLOOKUP(C14,'Jours fériés'!$B$4:$E$1829,2,FALSE)=\"s\",\"S\",\"FDS\")","v":{"$error":"#N/A"}},{"$f":"IF(VLOOKUP(B14,'Jours fériés'!$B$4:$E$1829,3,FALSE)=\"Oui\",\"F\",\"\")","v":{"$error":"#N/A"}},{"$f":"IF(VLOOKUP(C14,'Jours fériés'!$B$4:$E$1829,3,FALSE)=\"Oui\",\"F\",\"\")","v":{"$error":"#N/A"}}]
["Jour + Nuit",{"$f":"IF(AND(C14-B14=1,B16+K30<=A10),\n\"non\",IF(\nC14-B14=1,\"oui\",\"non\"))","v":"non"},{"$f":"IF(B25=\"oui\",B15,\"\")","v":""},{"$f":"IF(C25<>\"\",C16,\"\")","v":""},{"$f":"IF(D25<>\"\",($A$10-C25)+D25,\"\")","v":""},null,{"$f":"IF(G20=\"\",\"\",G20)","v":""},{"$f":"TEXT(IFERROR(IF(H20=\"\",\"\",H20),\"\"),\"hh:mm\")","v":""},{"$f":"IFERROR(IF(I20=\"\",\"\",I20),\"\")","v":"00:00:00"},{"$f":"IF(VLOOKUP(B14,'Jours fériés'!$B$4:$E$1829,2,FALSE)=\"s\",\"S\",\"FDS\")","v":{"$error":"#N/A"}},{"$f":"IF(VLOOKUP(C14,'Jours fériés'!$B$4:$E$1829,2,FALSE)=\"s\",\"S\",\"FDS\")","v":{"$error":"#N/A"}},{"$f":"IF(VLOOKUP(B14,'Jours fériés'!$B$4:$E$1829,3,FALSE)=\"Oui\",\"F\",\"\")","v":{"$error":"#N/A"}},{"$f":"IF(VLOOKUP(C14,'Jours fériés'!$B$4:$E$1829,3,FALSE)=\"Oui\",\"F\",\"\")","v":{"$error":"#N/A"}}]
[null,null,{"$f":"C25","v":""},{"$f":"D25","v":""},{"$f":"SUM(E22:E25)","v":{"$error":"#VALUE!"}},null,{"$f":"TEXT(IF(L33=TRUE,SUM(G22:G25),\"\"),\"hh:mm\")","v":""},{"$f":"TEXT(IF(H23<>\"\",H23,IF(H24<>\"\",H24,IF(H25<>\"\",H25,\"\"))),\"hh:mm\")","v":{"$error":"#VALUE!"}},{"$f":"TEXT(IF(L35=TRUE,SUM(I22:I25),\"\"),\"hh:mm\")","v":{"$error":"#VALUE!"}}]
[]
[]
[]
[null,"JOUR","NUIT","Taux","en centièmes X 1","Heures X 2","en centièmes X 2","TOTAL",null,null,"09:00:00",null,"09:00:00","18:00:00"]
["Semaine jour 1",{"$f":"TEXT(IF(AND(G26<>\"\",J25=\"S\",L25<>\"F\"),G26,\"0\"),\"hh:mm\")","v":{"$error":"#N/A"}},null,{"$f":"$D$3","v":28.75},{"$f":"IF(AND(B31<>$A$5,B31<>\"\"),ROUND(B31*24,2),)","v":{"$error":"#N/A"}},{"$f":"B31*'Calculs choix indemnité'!$F$17","v":{"$error":"#N/A"}},{"$f":"ROUND(IF($N$33=2,(VLOOKUP(E31,équivalence,2,FALSE))),2)","v":0},{"$f":"IF(AND(G31=0,$N$33=1),E31*D31,IF($N$33=2,G31*D31,))","v":0},null,null,null,null,"09:00:00","18:00:00",null,{"$f":"LEFT(O31,2)","v":""}]
["Semaine jour 2",{"$f":"TEXT(IF(AND(I26<>\"\",K25=\"S\",M25<>\"F\"),I26,\"0\"),\"hh:mm\")","v":{"$error":"#VALUE!"}},null,{"$f":"$D$3","v":28.75},{"$error":"#VALUE!"},{"$f":"B32*'Calculs choix indemnité'!$F$17","v":{"$error":"#VALUE!"}},0,0,null,null,"Tableau Total en orange:",{"$f":"OR($H31<>\"\",$H32<>\"\",$H33<>\"\",$H34<>\"\",$H35<>\"\",$H36<>\"\",$H37<>\"\",$H38<>\"\",$H39<>\"\")","v":true},null,null,null,{"$f":"RIGHT(O31,2)","v":""}]
["Fin de semaine jour 1",{"$f":"TEXT(IF(AND(G26<>\"\",J25=\"fds\",L25<>\"F\"),G26,\"0\"),\"hh:mm\")","v":{"$error":"#N/A"}},null,{"$f":"$D$5","v":31.75},{"$error":"#N/A"},{"$f":"B33*'Calculs choix indemnité'!$F$17","v":{"$error":"#N/A"}},0,0,null,null,"Tableau durée jour:",{"$f":"OR($G22<>\"\",$G24<>\"\",$G25<>\"\")","v":false},"nbre préposés",{"$f":"'Calculs choix indemnité'!F17","v":0}]
["Fin de semaine jour 2",{"$f":"TEXT(IF(AND(I26<>\"\",K25=\"fds\",M25<>\"F\"),I26,\"0\"),\"hh:mm\")","v":{"$error":"#VALUE!"}},null,{"$f":"$D$5","v":31.75},{"$error":"#VALUE!"},{"$f":"B34*'Calculs choix indemnité'!$F$17","v":{"$error":"#VALUE!"}},0,0,null,null,"Tableau durée nuit:",{"$f":"OR($H22<>\"\",$H23<>\"\",$H24<>\"\",$H25<>\"\")","v":{"$error":"#VALUE!"}}]
["Férié jour 1",{"$f":"TEXT(IF(AND(G26<>\"\",L25=\"F\"),G26,\"0\"),\"hh:mm\")","v":{"$error":"#N/A"}},null,{"$f":"$D$7","v":40},{"$error":"#N/A"},{"$f":"B35*'Calculs choix indemnité'!$F$17","v":{"$error":"#N/A"}},0,0,null,null,"Tableau durée jour 2:",{"$f":"OR(I23<>\"\",I24<>\"\",I25<>\"\")","v":{"$error":"#VALUE!"}}]
["Férie jour 2",{"$f":"TEXT(IF(AND(I26<>\"\",M25=\"F\"),I26,\"0\"),\"hh:mm\")","v":{"$error":"#VALUE!"}},null,{"$f":"$D$7","v":40},{"$error":"#VALUE!"},{"$f":"B36*'Calculs choix indemnité'!$F$17","v":{"$error":"#VALUE!"}},0,0]
["Semaine nuit",null,{"$f":"TEXT(IF(AND(H26<>\"\",K25=\"S\",M25<>\"F\"),H26+0,\"0\"),\"hh:mm\")","v":{"$error":"#VALUE!"}},{"$f":"$D$4","v":35.5},{"$f":"IF(C37<>\"\",ROUND(C37*24,2),\"0\")","v":{"$error":"#VALUE!"}},{"$f":"C37*'Calculs choix indemnité'!$F$17","v":{"$error":"#VALUE!"}},0,0]
["Fin de semaine nuit",null,{"$f":"TEXT(IF(AND(H26<>\"\",K25=\"FDS\",M25<>\"F\"),H26+0,\"0\"),\"hh:mm\")","v":{"$error":"#VALUE!"}},{"$f":"$D$6","v":38.5},{"$f":"IF(C38<>\"\",ROUND(C38*24,2),\"0\")","v":{"$error":"#VALUE!"}},{"$f":"C38*'Calculs choix indemnité'!$F$17","v":{"$error":"#VALUE!"}},{"$f":"ROUND(IF($N$33=2,(VLOOKUP(E38,équivalence,2,FALSE))),2)","v":0},0]
["Férié nuit",null,{"$f":"TEXT(IF(AND(H26<>\"\",M25=\"F\"),H26+0,\"0\"),\"hh:mm\")","v":{"$error":"#VALUE!"}},{"$f":"$D$8","v":48},{"$f":"IF(C39<>\"\",ROUND(C39*24,2),\"0\")","v":{"$error":"#VALUE!"}},{"$f":"C39*'Calculs choix indemnité'!$F$17","v":{"$error":"#VALUE!"}},{"$f":"ROUND(IF($N$33=2,(VLOOKUP(E39,équivalence,2,FALSE))),2)","v":0},0,null,{"$f":"E39","v":{"$error":"#VALUE!"}}]
[null,null,null,null,{"$f":"SUM(E31:E39)","v":{"$error":"#N/A"}},{"$f":"SUM(F31:F39)","v":{"$error":"#N/A"}},{"$f":"SUM(G31:G39)","v":0},{"$f":"SUM($H31:$H39)","v":0}]
[null,null,null,null,{"$f":"IFERROR(E33,\"non\")","v":"non"}]
[]
[]
[null,"Début","Fin",null,null,null,"Attente 2"]
["Date début /  fin",{"$f":"Attente!D28","v":"00:00:00"},{"$f":"Attente!F28","v":"00:00:00"},{"$f":"TEXT(B45,\"aaaa-mm-jj \")&TEXT(B46,\"hh:mm\")","v":"1900-01-00 00:00"}]
["Heure début / fin",{"$f":"TEXT(Attente!D30,\"hh:mm\")","v":"00:00"},{"$f":"(TEXT(Attente!F30,\"hh:mm\"))","v":"00:00"},{"$f":"TEXT(C45,\"aaaa-mm-jj \")&TEXT(C46,\"hh:mm\")","v":"1900-01-00 00:00"}]
["Heure modifiée",{"$f":"TEXT(B46,\"hh:mm\")","v":"00:00"},{"$f":"TEXT(IF(D47<K61,C46,B47+K61),\"hh:mm\")","v":{"$error":"#VALUE!"}},{"$f":"D46-D45","v":{"$error":"#VALUE!"}}]
[]
[]
[]
[null,null,null,null,{"$f":"IF(E53>=K61,\"Dépassement\",\"\")","v":"Dépassement"},null,{"$f":"IFERROR(IF(AND(B56=\"oui\",D47<K61),$A$10-C56,$A$10-C56),\"\")","v":""},{"$f":"TEXT(IFERROR(IF(AND(C47>$A$8,B56=\"oui\"),$A$8,E56-G56),\"\"),\"hh:mm\")","v":""},{"$f":"IFERROR(IF(AND(E56-G51-H51>0,B56=\"oui\"),IF(C47-$A$8>0,C47-$A$8,\"\")),)","v":"00:00:00"},"Semaine  ou FDS",null,"Férié ou ordinaire"]
[null,null,"Début","Fin","Durée totale",null,"Durée jour 1","Durée nuit","Durée jour 2","Jour 1","Jour 2","Jour 1","Jour 2"]
["Jour + Jour",{"$f":"IF(C45-B45=0,\n\"oui\",IF(AND(C45-B45=1,B47+K30<=A10),\n\"oui\",\n\"non\"))","v":"oui"},{"$f":"IF(AND(B47>=$A$8,\nB47<=$A$7,\nB53=\"oui\"),\nB47,\"\")","v":""},{"$f":"IF(C53<>\"\",C47,\"\")","v":""},{"$f":"IF(AND(D53=\"\",C53=\"\"),\"\",IF(D53=\"00:00\",A10-B47,D53-C53))","v":""},null,{"$f":"$E53","v":""},null,null,{"$f":"IFERROR(IF(VLOOKUP(B45,'Jours fériés'!$B$4:$E$1829,2,FALSE)=\"s\",\"S\",\"FDS\"),0)","v":0},null,{"$f":"IF(VLOOKUP(B45,'Jours fériés'!$B$4:$E$1829,3,FALSE)=\"Oui\",\"F\",\"\")","v":{"$error":"#N/A"}}]
["Nuit+ Nuit",{"$f":"IF(C45-B45=0,\"oui\",\"non\")","v":"oui"},{"$f":"IF(AND(B47>=$A$5,\nC47<=$A$8,\nB54=\"oui\"),\nB47,\"\")","v":{"$error":"#VALUE!"}},{"$f":"IF(C54<>\"\",C47,\"\")","v":{"$error":"#VALUE!"}},{"$f":"TEXT(IF(D54<>\"\",D54-C54,\"\"),\"hh:mm\")","v":{"$error":"#VALUE!"}},null,null,{"$f":"TEXT($E54,\"hh:mm\")","v":{"$error":"#VALUE!"}},null,{"$f":"IF(VLOOKUP(B45,'Jours fériés'!B32:$E$1829,2,FALSE)=\"s\",\"S\",\"FDS\")","v":{"$error":"#N/A"}},null,{"$f":"IF(VLOOKUP(B45,'Jours fériés'!$B$4:$E$1829,3,FALSE)=\"Oui\",\"F\",\"\")","v":{"$error":"#N/A"}}]
["Nuit + Jour",{"$f":"IF(C45-B45=0,\"oui\",\"non\")","v":"oui"},{"$f":"IF(AND(B47>$A$5,\nC47>$A$8,\nB47<A8,\nB55=\"oui\"),\nB47,\"\")","v":{"$error":"#VALUE!"}},{"$f":"IF(C55<>\"\",C47,\"\")","v":{"$error":"#VALUE!"}},{"$f":"TEXT(IF(D55<>\"\",D55-C55,\"\"),\"hh:mm\")","v":{"$error":"#VALUE!"}},null,null,{"$f":"TEXT(IF(D55<>\"\",$A$8-C55,\"\"),\"hh:mm\")","v":{"$error":"#VALUE!"}},{"$f":"IF(E55<>\"\",D55-$A$8,\"\")","v":{"$error":"#VALUE!"}},{"$f":"IF(VLOOKUP(B45,'Jours fériés'!$B$4:$E$1829,2,FALSE)=\"s\",\"S\",\"FDS\")","v":{"$error":"#N/A"}},{"$f":"IF(VLOOKUP(C45,'Jours fériés'!$B$4:$E$1829,2,FALSE)=\"s\",\"S\",\"FDS\")","v":{"$error":"#N/A"}},{"$f":"IF(VLOOKUP(B45,'Jours fériés'!$B$4:$E$1829,3,FALSE)=\"Oui\",\"F\",\"\")","v":{"$error":"#N/A"}},{"$f":"IF(VLOOKUP(C45,'Jours fériés'!$B$4:$E$1829,3,FALSE)=\"Oui\",\"F\",\"\")","v":{"$error":"#N/A"}}]
["Jour + Nuit",{"$f":"IF(AND(C45-B45=1,B47+K30<=A10),\n\"non\",\nIF(C45-B45=1,\"oui\",\"non\"))","v":"non"},{"$f":"IF(B56=\"oui\",B46,\"\")","v":""},{"$f":"IF(C56<>\"\",C47,\"\")","v":""},{"$f":"IF(D56<>\"\",($A$10-C56)+D56,\"\")","v":""},null,{"$f":"IF(G51=\"\",\"\",G51)","v":""},{"$f":"TEXT(IFERROR(IF(H51=\"\",\"\",H51),\"\"),\"hh:mm\")","v":""},{"$f":"IFERROR(IF(I51=\"\",\"\",I51),\"\")","v":"00:00:00"},{"$f":"IF(VLOOKUP(B45,'Jours fériés'!$B$4:$E$1829,2,FALSE)=\"s\",\"S\",\"FDS\")","v":{"$error":"#N/A"}},{"$f":"IF(VLOOKUP(C45,'Jours fériés'!$B$4:$E$1829,2,FALSE)=\"s\",\"S\",\"FDS\")","v":{"$error":"#N/A"}},{"$f":"IF(VLOOKUP(B45,'Jours fériés'!$B$4:$E$1829,3,FALSE)=\"Oui\",\"F\",\"\")","v":{"$error":"#N/A"}},{"$f":"IF(VLOOKUP(C45,'Jours fériés'!$B$4:$E$1829,3,FALSE)=\"Oui\",\"F\",\"\")","v":{"$error":"#N/A"}}]
[null,null,{"$f":"C56","v":""},{"$f":"D56","v":""},{"$f":"SUM(E53:E56)","v":{"$error":"#VALUE!"}},null,{"$f":"TEXT(IF(L64=TRUE,SUM(G53:G56),\"\"),\"hh:mm\")","v":""},{"$f":"IF(H54<>\"\",H54,IF(H55<>\"\",H55,IF(H56<>\"\",H56,\"\")))","v":{"$error":"#VALUE!"}},{"$f":"TEXT(IF(L66=TRUE,SUM(I53:I56),\"\"),\"hh:mm\")","v":{"$error":"#VALUE!"}}]
[]
[]
[]
[null,"JOUR","NUIT","Taux","en centièmes X 1","Heures X 2","en centièmes X 2","TOTAL",null,null,"09:00:00",null,"09:00:00","18:00:00"]
["Semaine jour 1",{"$f":"TEXT(IF(AND(G57<>\"\",J56=\"S\",L56<>\"F\"),G57,\"0\"),\"hh:mm\")","v":{"$error":"#N/A"}},null,{"$f":"$D$3","v":28.75},{"$f":"IF(AND(B62<>$A$5,B62<>\"\"),ROUND(B62*24,2),)","v":{"$error":"#N/A"}},{"$f":"B62*'Calculs choix indemnité'!$F$17","v":{"$error":"#N/A"}},{"$f":"ROUND(IF($N$33=2,(VLOOKUP(E62,équivalence,2,FALSE))),2)","v":0},{"$f":"IF(AND(G62=0,$N$33=1),E62*D62,IF($N$33=2,G62*D62,))","v":0},null,null,null,null,"09:00:00","18:00:00"]
["Semaine jour 2",{"$f":"TEXT(IF(AND(I57<>\"\",K56=\"S\",M56<>\"F\"),I57,\"0\"),\"hh:mm\")","v":{"$error":"#VALUE!"}},null,{"$f":"$D$3","v":28.75},{"$error":"#VALUE!"},{"$f":"B63*'Calculs choix indemnité'!$F$17","v":{"$error":"#VALUE!"}},0,0,null,null,"Tableau Total en orange:",{"$f":"OR($H62<>\"\",$H63<>\"\",$H64<>\"\",$H65<>\"\",$H66<>\"\",$H67<>\"\",$H68<>\"\",$H69<>\"\",$H70<>\"\")","v":true}]
["Fin de semaine jour 1",{"$f":"TEXT(IF(AND(G57<>\"\",J56=\"fds\",L56<>\"F\"),G57,\"0\"),\"hh:mm\")","v":{"$error":"#N/A"}},null,{"$f":"$D$5","v":31.75},{"$error":"#N/A"},{"$f":"B64*'Calculs choix indemnité'!$F$17","v":{"$error":"#N/A"}},0,0,null,null,"Tableau durée jour:",{"$f":"OR($G53<>\"\",$G55<>\"\",$G56<>\"\")","v":false},"nbre préposés",{"$f":"'Calculs choix indemnité'!F17","v":0}]
["Fin de semaine jour 2",{"$f":"TEXT(IF(AND(I57<>\"\",K56=\"fds\",M56<>\"F\"),I57,\"0\"),\"hh:mm\")","v":{"$error":"#VALUE!"}},null,{"$f":"$D$5","v":31.75},{"$error":"#VALUE!"},{"$f":"B65*'Calculs choix indemnité'!$F$17","v":{"$error":"#VALUE!"}},0,0,null,null,"Tableau durée nuit:",{"$f":"OR($H53<>\"\",$H54<>\"\",$H55<>\"\",$H56<>\"\")","v":{"$error":"#VALUE!"}}]
["Férié jour 1",{"$f":"TEXT(IF(AND(G57<>\"\",L56=\"F\"),G57,\"0\"),\"hh:mm\")","v":{"$error":"#N/A"}},null,{"$f":"$D$7","v":40},{"$error":"#N/A"},{"$f":"B66*'Calculs choix indemnité'!$F$17","v":{"$error":"#N/A"}},0,0,null,null,"Tableau durée jour 2:",{"$f":"OR(I54<>\"\",I55<>\"\",I56<>\"\")","v":{"$error":"#VALUE!"}}]
["Férie jour 2",{"$f":"TEXT(IF(AND(I57<>\"\",M56=\"F\"),I57,\"0\"),\"hh:mm\")","v":{"$error":"#VALUE!"}},null,{"$f":"$D$7","v":40},{"$error":"#VALUE!"},{"$f":"B67*'Calculs choix indemnité'!$F$17","v":{"$error":"#VALUE!"}},0,0]
["Semaine nuit",null,{"$f":"TEXT(IF(AND(H57<>\"\",K56=\"S\",M56<>\"F\"),H57+0,\"0\"),\"hh:mm\")","v":{"$error":"#VALUE!"}},{"$f":"$D$4","v":35.5},{"$f":"IF(C68<>\"\",ROUND(C68*24,2),\"0\")","v":{"$error":"#VALUE!"}},{"$f":"C68*'Calculs choix indemnité'!$F$17","v":{"$error":"#VALUE!"}},0,0]
["Fin de semaine nuit",null,{"$f":"TEXT(IF(AND(H57<>\"\",K56=\"FDS\",M56<>\"F\"),H57+0,\"0\"),\"hh:mm\")","v":{"$error":"#VALUE!"}},{"$f":"$D$6","v":38.5},{"$f":"IF(C69<>\"\",ROUND(C69*24,2),\"0\")","v":{"$error":"#VALUE!"}},{"$f":"C69*'Calculs choix indemnité'!$F$17","v":{"$error":"#VALUE!"}},0,0]
["Férié nuit",null,{"$f":"TEXT(IF(AND(H57<>\"\",M56=\"F\"),H57+0,\"0\"),\"hh:mm\")","v":{"$error":"#VALUE!"}},{"$f":"$D$8","v":48},{"$f":"IF(C70<>\"\",ROUND(C70*24,2),\"0\")","v":{"$error":"#VALUE!"}},{"$f":"C70*'Calculs choix indemnité'!$F$17","v":{"$error":"#VALUE!"}},0,0]
[null,null,null,"Pour 1 préposé",{"$f":"SUM(E62:E70)","v":{"$error":"#N/A"}},{"$f":"SUM(F62:F70)","v":{"$error":"#N/A"}},{"$f":"SUM(G62:G70)","v":0},{"$f":"SUM($H62:$H70)","v":0}]
[]
[]
[]
[null,"Début","Fin",null,null,null,"Attente 3"]
["Date début /  fin",{"$f":"Attente!D37","v":"00:00:00"},{"$f":"Attente!F37","v":"00:00:00"},{"$f":"TEXT(B76,\"aaaa-mm-jj \")&TEXT(B77,\"hh:mm\")","v":"1900-01-00 00:00"}]
["Heure début / fin",{"$f":"TEXT(Attente!D39,\"hh:mm\")","v":"00:00"},{"$f":"(TEXT(Attente!F39,\"hh:mm\"))","v":"00:00"},{"$f":"TEXT(C76,\"aaaa-mm-jj \")&TEXT(C77,\"hh:mm\")","v":"1900-01-00 00:00"}]
["Heure modifiée",{"$f":"TEXT(B77,\"hh:mm\")","v":"00:00"},{"$f":"TEXT(IF(D78<K92,C77,B78+K92),\"hh:mm\")","v":{"$error":"#VALUE!"}},{"$f":"D77-D76","v":{"$error":"#VALUE!"}}]
[]
[]
[]
[null,null,null,null,{"$f":"IF(E84>=K92,\"Dépassement\",\"\")","v":"Dépassement"},null,{"$f":"IFERROR(IF(AND(B87=\"oui\",D78<K92),$A$10-C87,$A$10-C87),\"\")","v":""},{"$f":"TEXT(IFERROR(IF(AND(C78>$A$8,B87=\"oui\"),$A$8,E87-G87),\"\"),\"hh:mm\")","v":""},{"$f":"IFERROR(IF(AND(E87-G82-H82>0,B87=\"oui\"),IF(C78-$A$8>0,C78-$A$8,\"\")),)","v":"00:00:00"},"Semaine  ou FDS",null,"Férié ou ordinaire"]
[null,null,"Début","Fin","Durée totale",null,"Durée jour 1","Durée nuit","Durée jour 2","Jour 1","Jour 2","Jour 1","Jour 2"]
["Jour + Jour",{"$f":"IF(C76-B76=0,\n\"oui\",IF(AND(C76-B76=1,B78+K30<=A10),\n\"oui\",\n\"non\"))","v":"oui"},{"$f":"IF(AND(B78>=$A$8,B78<=$A$7,B84=\"oui\"),B78,\"\")","v":""},{"$f":"IF(C84<>\"\",C78,\"\")","v":""},{"$f":"IF(AND(D84=\"\",C84=\"\"),\"\",IF(D84=\"00:00\",A10-B78,D84-C84))","v":""},null,{"$f":"$E84","v":""},null,null,{"$f":"IFERROR(IF(VLOOKUP(B76,'Jours fériés'!$B$4:$E$1829,2,FALSE)=\"s\",\"S\",\"FDS\"),0)","v":0},null,{"$f":"IF(VLOOKUP(B76,'Jours fériés'!$B$4:$E$1829,3,FALSE)=\"Oui\",\"F\",\"\")","v":{"$error":"#N/A"}}]
["Nuit+ Nuit",{"$f":"IF(C76-B76=0,\"oui\",\"non\")","v":"oui"},{"$f":"IF(AND(B78>=$A$5,C78<=$A$8,B85=\"oui\"),B78,\"\")","v":{"$error":"#VALUE!"}},{"$f":"IF(C85<>\"\",C78,\"\")","v":{"$error":"#VALUE!"}},{"$f":"TEXT(IF(D85<>\"\",D85-C85,\"\"),\"hh:mm\")","v":{"$error":"#VALUE!"}},null,null,{"$f":"TEXT($E85,\"hh:mm\")","v":{"$error":"#VALUE!"}},null,{"$f":"IF(VLOOKUP(B76,'Jours fériés'!B63:$E$1829,2,FALSE)=\"s\",\"S\",\"FDS\")","v":{"$error":"#N/A"}},null,{"$f":"IF(VLOOKUP(B76,'Jours fériés'!$B$4:$E$1829,3,FALSE)=\"Oui\",\"F\",\"\")","v":{"$error":"#N/A"}}]
["Nuit + Jour",{"$f":"IF(C76-B76=0,\"oui\",\"non\")","v":"oui"},{"$f":"IF(AND(B78>$A$5,\nC78>$A$8,\nB78<A8,\nB86=\"oui\"),B78,\"\")","v":{"$error":"#VALUE!"}},{"$f":"IF(C86<>\"\",C78,\"\")","v":{"$error":"#VALUE!"}},{"$f":"TEXT(IF(D86<>\"\",D86-C86,\"\"),\"hh:mm\")","v":{"$error":"#VALUE!"}},null,null,{"$f":"TEXT(IF(D86<>\"\",$A$8-C86,\"\"),\"hh:mm\")","v":{"$error":"#VALUE!"}},{"$f":"IF(E86<>\"\",D86-$A$8,\"\")","v":{"$error":"#VALUE!"}},{"$f":"IF(VLOOKUP(B76,'Jours fériés'!$B$4:$E$1829,2,FALSE)=\"s\",\"S\",\"FDS\")","v":{"$error":"#N/A"}},{"$f":"IF(VLOOKUP(C76,'Jours fériés'!$B$4:$E$1829,2,FALSE)=\"s\",\"S\",\"FDS\")","v":{"$error":"#N/A"}},{"$f":"IF(VLOOKUP(B76,'Jours fériés'!$B$4:$E$1829,3,FALSE)=\"Oui\",\"F\",\"\")","v":{"$error":"#N/A"}},{"$f":"IF(VLOOKUP(C76,'Jours fériés'!$B$4:$E$1829,3,FALSE)=\"Oui\",\"F\",\"\")","v":{"$error":"#N/A"}}]
["Jour + Nuit",{"$f":"IF(AND(C76-B76=1,B78+K30<=A10),\n\"non\",IF(C76-B76=1,\"oui\",\"non\"))","v":"non"},{"$f":"IF(B87=\"oui\",B77,\"\")","v":""},{"$f":"IF(C87<>\"\",C78,\"\")","v":""},{"$f":"IF(D87<>\"\",($A$10-C87)+D87,\"\")","v":""},null,{"$f":"IF(G82=\"\",\"\",G82)","v":""},{"$f":"TEXT(IFERROR(IF(H82=\"\",\"\",H82),\"\"),\"hh:mm\")","v":""},{"$f":"IFERROR(IF(I82=\"\",\"\",I82),\"\")","v":"00:00:00"},{"$f":"IF(VLOOKUP(B76,'Jours fériés'!$B$4:$E$1829,2,FALSE)=\"s\",\"S\",\"FDS\")","v":{"$error":"#N/A"}},{"$f":"IF(VLOOKUP(C76,'Jours fériés'!$B$4:$E$1829,2,FALSE)=\"s\",\"S\",\"FDS\")","v":{"$error":"#N/A"}},{"$f":"IF(VLOOKUP(B76,'Jours fériés'!$B$4:$E$1829,3,FALSE)=\"Oui\",\"F\",\"\")","v":{"$error":"#N/A"}},{"$f":"IF(VLOOKUP(C76,'Jours fériés'!$B$4:$E$1829,3,FALSE)=\"Oui\",\"F\",\"\")","v":{"$error":"#N/A"}}]
[null,null,{"$f":"C87","v":""},{"$f":"D87","v":""},{"$f":"SUM(E84:E87)","v":{"$error":"#VALUE!"}},null,{"$f":"TEXT(IF(L95=TRUE,SUM(G84:G87),\"\"),\"hh:mm\")","v":""},{"$f":"IF(H85<>\"\",H85,IF(H86<>\"\",H86,IF(H87<>\"\",H87,\"\")))","v":{"$error":"#VALUE!"}},{"$f":"TEXT(IF(L97=TRUE,SUM(I84:I87),\"\"),\"hh:mm\")","v":{"$error":"#VALUE!"}}]
[]
[]
[]
[null,"JOUR","NUIT","Taux","en centièmes X 1","Heures X 2","en centièmes X 2","TOTAL",null,null,"09:00:00",null,"09:00:00","18:00:00"]
["Semaine jour 1",{"$f":"TEXT(IF(AND(G88<>\"\",J87=\"S\",L87<>\"F\"),G88,\"0\"),\"hh:mm\")","v":{"$error":"#N/A"}},null,{"$f":"$D$3","v":28.75},{"$f":"IF(AND(B93<>$A$5,B93<>\"\"),ROUND(B93*24,2),)","v":{"$error":"#N/A"}},{"$f":"B93*'Calculs choix indemnité'!$F$17","v":{"$error":"#N/A"}},{"$f":"ROUND(IF($N$33=2,(VLOOKUP(E93,équivalence,2,FALSE))),2)","v":0},{"$f":"IF(AND(G93=0,$N$33=1),E93*D93,IF($N$33=2,G93*D93,))","v":0},null,null,null,null,"09:00:00","18:00:00"]
["Semaine jour 2",{"$f":"TEXT(IF(AND(I88<>\"\",K87=\"S\",M87<>\"F\"),I88,\"0\"),\"hh:mm\")","v":{"$error":"#VALUE!"}},null,{"$f":"$D$3","v":28.75},{"$error":"#VALUE!"},{"$f":"B94*'Calculs choix indemnité'!$F$17","v":{"$error":"#VALUE!"}},0,0,null,null,"Tableau Total en orange:",{"$f":"OR($H93<>\"\",$H94<>\"\",$H95<>\"\",$H96<>\"\",$H97<>\"\",$H98<>\"\",$H99<>\"\",$H100<>\"\",$H101<>\"\")","v":true}]
["Fin de semaine jour 1",{"$f":"TEXT(IF(AND(G88<>\"\",J87=\"fds\",L87<>\"F\"),G88,\"0\"),\"hh:mm\")","v":{"$error":"#N/A"}},null,{"$f":"$D$5","v":31.75},{"$error":"#N/A"},{"$f":"B95*'Calculs choix indemnité'!$F$17","v":{"$error":"#N/A"}},0,0,null,null,"Tableau durée jour:",{"$f":"OR($G84<>\"\",$G86<>\"\",$G87<>\"\")","v":false},"nbre préposés",{"$f":"'Calculs choix indemnité'!F48","v":0}]
["Fin de semaine jour 2",{"$f":"TEXT(IF(AND(I88<>\"\",K87=\"fds\",M87<>\"F\"),I88,\"0\"),\"hh:mm\")","v":{"$error":"#VALUE!"}},null,{"$f":"$D$5","v":31.75},{"$error":"#VALUE!"},{"$f":"B96*'Calculs choix indemnité'!$F$17","v":{"$error":"#VALUE!"}},0,0,null,null,"Tableau durée nuit:",{"$f":"OR($H84<>\"\",$H85<>\"\",$H86<>\"\",$H87<>\"\")","v":{"$error":"#VALUE!"}}]
["Férié jour 1",{"$f":"TEXT(IF(AND(G88<>\"\",L87=\"F\"),G88,\"0\"),\"hh:mm\")","v":{"$error":"#N/A"}},null,{"$f":"$D$7","v":40},{"$error":"#N/A"},{"$f":"B97*'Calculs choix indemnité'!$F$17","v":{"$error":"#N/A"}},0,0,null,null,"Tableau durée jour 2:",{"$f":"OR(I85<>\"\",I86<>\"\",I87<>\"\")","v":{"$error":"#VALUE!"}}]
["Férie jour 2",{"$f":"TEXT(IF(AND(I88<>\"\",M87=\"F\"),I88,\"0\"),\"hh:mm\")","v":{"$error":"#VALUE!"}},null,{"$f":"$D$7","v":40},{"$error":"#VALUE!"},{"$f":"B98*'Calculs choix indemnité'!$F$17","v":{"$error":"#VALUE!"}},0,0]
["Semaine nuit",null,{"$f":"TEXT(IF(AND(H88<>\"\",K87=\"S\",M87<>\"F\"),H88+0,\"0\"),\"hh:mm\")","v":{"$error":"#VALUE!"}},{"$f":"$D$4","v":35.5},{"$f":"IF(C99<>\"\",ROUND(C99*24,2),\"0\")","v":{"$error":"#VALUE!"}},{"$f":"C99*'Calculs choix indemnité'!$F$17","v":{"$error":"#VALUE!"}},0,0]
["Fin de semaine nuit",null,{"$f":"TEXT(IF(AND(H88<>\"\",K87=\"FDS\",M87<>\"F\"),H88+0,\"0\"),\"hh:mm\")","v":{"$error":"#VALUE!"}},{"$f":"$D$6","v":38.5},{"$f":"IF(C100<>\"\",ROUND(C100*24,2),\"0\")","v":{"$error":"#VALUE!"}},{"$f":"C100*'Calculs choix indemnité'!$F$17","v":{"$error":"#VALUE!"}},0,0]
["Férié nuit",null,{"$f":"TEXT(IF(AND(H88<>\"\",M87=\"F\"),H88+0,\"0\"),\"hh:mm\")","v":{"$error":"#VALUE!"}},{"$f":"$D$8","v":48},{"$f":"IF(C101<>\"\",ROUND(C101*24,2),\"0\")","v":{"$error":"#VALUE!"}},{"$f":"C101*'Calculs choix indemnité'!$F$17","v":{"$error":"#VALUE!"}},0,0]
[null,{"$f":"SUM(B93:B101)","v":{"$error":"#N/A"}},{"$f":"SUM(C93:C101)","v":{"$error":"#VALUE!"}},null,{"$f":"SUM(E93:E101)","v":{"$error":"#N/A"}},{"$f":"SUM(F93:F101)","v":{"$error":"#N/A"}},{"$f":"SUM(G93:G101)","v":0},{"$f":"SUM($H93:$H101)","v":0}]
[]
[]
[]
[]
[null,null,null,"07:35:00"]
[null,null,null,{"$f":"D107*2","v":0.63194444444444442}]
[null,null,null,{"$f":"D108*24","v":15.166666666666666}]
[null,null,null,"14:00:00"]
[null,null,null,{"$f":"D110*24","v":14}]

{"sheet":"Calculs choix indemnité","index":8,"n_rows":38,"n_cols":7,"rows_kept":38,"cut":false,"hidden":true,"merged":[[9,3,9,10],[10,3,10,10],[35,0,35,6],[32,0,32,5],[34,0,34,5],[33,0,33,5],[18,2,18,7]]}
[]
[]
["NE RIEN MODIFIER DANS CE TABLEAU SOUS PEINE D'ÉLECTROCUTION"]
[]
[null,null,"1er trsp"]
[]
[{"$f":"IF(Général!$G$14=\"\",\"\",(TEXT(Général!$G$14,\"aaaa-mm-jj\")))","v":""},{"$f":"IF(Général!$L$14=\"\",\"\",TEXT(Général!$L$14,\"aaaa-mm-jj\"))","v":""}]
[{"$f":"IF(Général!$G$16=\"\",\"\",TEXT(Général!$G$16,\"hh:mm\"))","v":""},{"$f":"IF(Général!$L$16=\"\",\"\",TEXT(Général!$L$16,\"hh:mm\"))","v":""},{"$f":"B9-A9","v":{"$error":"#VALUE!"}}]
[{"$f":"A7&\" \"&A8","v":" "},{"$f":"B7&\" \"&B8","v":" "}]
[{"$f":"B9-A9","v":{"$error":"#VALUE!"}},{"$f":"IF(A10<A12,A21,IF(AND(A10>=A12,Hébergement!D17=\"\"),A22,IF(A10<A13,A23,IF(A10<A14,A24,IF(A10>A14,A25)))))","v":{"$error":"#VALUE!"}},null,"Inscrivez d'abord les dépenses réelles dans Repas et Stationnement. Choisissez ensuite la ville de votre destination. Enfin, utilisez le bouton Choix pour effectuer un choix entre l'indemnité journalière ou les dépenses réelles."]
[{"$f":"TEXT(B9-A9,\"[hh]:mm\")","v":{"$error":"#VALUE!"}}," et comprend un coucher.",null,"Inscrivez d'abord les dépenses réelles dans Repas, Hébergement et Stationnement. Utilisez ensuite le bouton Choix pour effectuer un choix entre l'indemnité journalière ou les dépenses réelles."]
["12:00:00"," et ne comprend pas de coucher."]
[0.75]
[1]
["choisi dans Hébergement","choisi dans Hébergement","pour faciliter l'indexation","Indemnité de 50 %","Indemnité de 100 %","nombre de préposés"]
[{"$f":"Hébergement!D17","v":0},{"$f":"Hébergement!D19","v":0},{"$f":"IF($B16=\"entre le 1er juillet et le 31 octobre\",\"haute saison\",\"basse saison\")","v":"basse saison"},{"$f":"INDEX(TAUX!$G$50:$H$58,MATCH($A16,TAUX!$F$50:$F$58,0),MATCH($C16,TAUX!$G$49:$H$49,0))","v":{"$error":"#N/A"}}]
[{"$f":"Hébergement!D17","v":0},{"$f":"Hébergement!D19","v":0},{"$f":"IF($B17=\"entre le 1er juillet et le 31 octobre\",\"haute saison\",\"basse saison\")","v":"basse saison"},null,{"$f":"INDEX(TAUX!$C$50:$D$58,MATCH($A17,TAUX!$B$50:$B$58,0),MATCH($C17,TAUX!$C$49:$D$49,0))","v":{"$error":"#N/A"}},{"$f":"Divers!$H$20","v":0}]
[{"$f":"B10","v":{"$error":"#VALUE!"}}]
[null,null,"Vous pouvez choisir de demander le remboursement des dépenses réelles ou une indemnité journalière. Inscrivez d'abord le coût des repas via le bouton Repas et le coût de l'hébergement via le bouton Hébergement. Effectuez ensuite votre choix via le bouton Choix."]
[]
["est inférieure à 12 heures",null,"La durée du transport est inférieure à 12 heures.",null,null,null,"La durée du transport est inférieure à 12 heures."]
["est supérieure à 12 heures",null,"La durée du transport est supérieure à 12 heures et ne comprend pas de coucher.",null,null,null,"La durée du transport est supérieure à 12 heures "]
["se situe entre 12 et 18 heures",null,"La durée du transport se situe entre 12 et 18 heures et comprend un coucher.",null,null,null,"La durée du transport se situe entre 12 et 18 heures"]
["se situe entre 18 et 24 heures",null,"La durée du transport se situe entre 18 et 24 heures et comprend un coucher.",null,null,null,"La durée du transport se situe entre 18 et 24 heures "]
["est supérieure à 24 heures",null,"La durée du transport est supérieure à 24 heures et comprend un coucher.",null,null,null,"La durée du transport est supérieure à 24 heures "]
[]
["Vous ne pouvez pas demander le remboursement des frais d'hébergement, par contre, vous avez droit au remboursement repas, s'il y a lieu."]
["Vous avez droit de demander le remboursement des frais d'hébergement et des repas, s'il y a lieu."]
[]
["Vous ne pouvez pas demander le remboursement des frais d'hébergement. Veuillez choisir NON s.v.p.!"]
[]
[]
["Vous n'avez pas droit à une indemnité journalière et devez demander le remboursement de vos dépenses relles pour les repas, s'il y a lieu, sur présentation de factures originales."]
["Vous pouvez choisir de demander 50 % de l'indemnité journalière prévue sans présentation de factures ou le remboursement des dépenses réelles sur présentation des factures originales."]
["Vous pouvez choisir de demander 100 % de l'indemnité journalière prévue sans présentation de factures ou le remboursement des dépenses réelles sur présentation des factures originales."]
["Vous pouvez choisir de demander 100 % de l'indemnité journalière prévue + les repas supplémentaires pris au-delà des 24 heures sans présentation de factures ou le remboursement des dépenses réelles sur présentation des factures originales."]
["50 % de l'indemnité prévue"]
["100 % de l'indemnité prévue + les repas pris au-delà de la période de 24 heures."]

{"sheet":"Divers","index":9,"n_rows":1168,"n_cols":8,"rows_kept":1168,"cut":false,"hidden":true,"merged":[]}
[]
[null,null,null,null,null,null,null,"Non"]
[null,null,"Pour calculer les frais de garde",null,null,"Période de coucher",null,"Oui"]
[]
[null,null,null,null,null,"Entre le 1er juillet et le 31 octobre"]
[null,null,"Cumulatif période de garde de 24 heures",null,null,"Entre le 1er novembre et le 30 juin"]
[null,"1 jour",1,null,null,null,"Entre le 1er novembre et le 30 juin","entre le 1er juillet et le 31 octobre"]
[null,"2 jours",2,null,null,"Montréal",{"$f":"TAUX!C50","v":218},{"$f":"TAUX!D50","v":234}]
[null,"3 jours",3,null,null,"Québec",{"$f":"TAUX!C51","v":192},{"$f":"TAUX!D51","v":192}]
[null,"4 jours",4,null,null,"Laval",{"$f":"TAUX!C52","v":187},{"$f":"TAUX!D52","v":197}]
[null,"5 jours",5,null,null,"Gatineau",{"$f":"TAUX!C53","v":187},{"$f":"TAUX!D53","v":197}]
[null,"6 jours",6,null,null,"Longueuil",{"$f":"TAUX!C54","v":187},{"$f":"TAUX!D54","v":197}]
[null,"7 jours",7,null,null,"Lac-Beauport",{"$f":"TAUX!C55","v":187},{"$f":"TAUX!D55","v":197}]
[null,"8 jours",8,null,null,"Lac-Delage",{"$f":"TAUX!C56","v":187},{"$f":"TAUX!D56","v":197}]
[null,"9 jours",9,null,null,"Rimouski",{"$f":"TAUX!C57","v":163},{"$f":"TAUX!D57","v":168}]
[null,"10 jours",10,null,null,"Ailleurs",{"$f":"TAUX!C58","v":163},{"$f":"TAUX!D58","v":168}]
[null,"11 jours",11]
[null,null,null,null,null,null,"1er préposé",{"$f":"IFERROR(IF(Général!$G9<>\"\",1),\"\")","v":false}]
[null,"ATTENTION:",null,null,null,null,"2e préposé",{"$f":"IFERROR(IF(Général!$G10<>\"\",1),\"\")","v":false}]
[null,null,null,null,null,null,"Total nombre de préposés",{"$f":"H18+H19","v":0}]
[null,"NE RIEN MODIFIER DANS CE TABLEAU."]
[null,"TOUTES LES DES DONNÉES PROVIENNENT DE L'ONGLET TAUX."]
[null,"SI CHANGEMENT DES TARIFS MAXIMUMS, FAIRE LES MODIFICATIONS DANS ONGLET TAUX",null,null,null,null,null,{"$f":"IFERROR(IF(Général!G9:J9<>\"\",1),\"\")","v":false}]
[]
[]
[]
[]
[null,"1 préposé en minutes","1 préposé en centièmes","2 préposés en centièmes","2 préposés en minutes"]
[null,"00:00:00",0,{"$f":"E29*24","v":0},{"$f":"B29*2","v":"00:00:00"}]
[null,"00:01:00",0.02,3.3333333333333333E-2,"00:02:00"]
[null,"00:02:00",0.03,6.6666666666666666E-2,"00:04:00"]
[null,"00:03:00",0.05,9.9999999999999839E-2,"00:06:00"]
[null,"00:04:00",7.0000000000000007E-2,0.13333333333333297,"00:08:00"]
[null,"00:05:00",0.08,0.16666666666666655,"00:10:00"]
[null,"00:06:00",0.1,0.19999999999999968,"00:12:00"]
[null,"00:07:00",0.12,0.23333333333333328,"00:14:00"]
[null,"00:08:00",0.13,0.26666666666666639,"00:16:00"]
[null,"00:09:00",0.15,0.30000000000000004,"00:18:00"]
[null,"00:10:00",0.17,0.33333333333333309,"00:20:00"]
[null,"00:11:00",0.18,0.36666666666666625,"00:22:00"]
[null,"00:12:00",0.2,0.3999999999999998,"00:24:00"]
[null,"00:13:00",0.22,0.43333333333333296,"00:26:00"]
[null,"00:14:00",0.23,0.46666666666666656,"00:28:00"]
[null,"00:15:00",0.25,0.50000000000000167,"00:30:00"]
[null,"00:16:00",0.27,0.53333333333333277,"00:32:00"]
[null,"00:17:00",0.28000000000000003,0.56666666666666399,"00:34:00"]
[null,"00:18:00",0.3,0.60000000000000009,"00:36:00"]
[null,"00:19:00",0.32,0.63333333333333119,"00:38:00"]
[null,"00:20:00",0.33,0.66666666666666241,"00:40:00"]
[null,"00:21:00",0.35,0.6999999999999984,"00:42:00"]
[null,"00:22:00",0.37,0.73333333333332962,"00:44:00"]
[null,"00:23:00",0.38,0.76666666666666561,"00:46:00"]
[null,"00:24:00",0.4,0.79999999999999682,"00:48:00"]
[null,"00:25:00",0.42,0.83333333333333282,"00:50:00"]
[null,"00:26:00",0.43,0.86666666666666392,"00:52:00"]
[null,"00:27:00",0.45,0.89999999999999991,"00:54:00"]
[null,"00:28:00",0.47,0.93333333333333113,"00:56:00"]
[null,"00:29:00",0.48,0.96666666666666234,"00:58:00"]
[null,"00:30:00",0.5,0.99999999999999845,"01:00:00"]
[null,"00:31:00",0.52,1.0333333333333297,"01:02:00"]
[null,"00:32:00",0.53,1.0666666666666655,"01:04:00"]
[null,"00:33:00",0.55000000000000004,1.0999999999999968,"01:06:00"]
[null,"00:34:00",0.56999999999999995,1.1333333333333329,"01:08:00"]
[null,"00:35:00",0.57999999999999996,1.1666666666666641,"01:10:00"]
[null,"00:36:00",0.6,1.2000000000000002,"01:12:00"]
[null,"00:37:00",0.62,1.2333333333333312,"01:14:00"]
[null,"00:38:00",0.63,1.2666666666666624,"01:16:00"]
[null,"00:39:00",0.65,1.2999999999999985,"01:18:00"]
[null,"00:40:00",0.67,1.3333333333333295,"01:20:00"]
[null,"00:41:00",0.68,1.3666666666666656,"01:22:00"]
[null,"00:42:00",0.7,1.3999999999999968,"01:24:00"]
[null,"00:43:00",0.72,1.4333333333333327,"01:26:00"]
[null,"00:44:00",0.73,1.4666666666666639,"01:28:00"]
[null,"00:45:00",0.75,1.5,"01:30:00"]
[null,"00:46:00",0.77,1.5333333333333312,"01:32:00"]
[null,"00:47:00",0.78,1.5666666666666624,"01:34:00"]
[null,"00:48:00",0.8,1.5999999999999983,"01:36:00"]
[null,"00:49:00",0.82,1.6333333333333295,"01:38:00"]
[{"$f":"TEXT(B79,\"hh:mm\")","v":"00:50"},"00:50:00",0.83,1.6666666666666667,"01:40:00"]
[null,"00:51:00",0.85,1.699999999999992,{"$f":"B80*2","v":"01:42:00"}]
[null,"00:52:00",0.87,1.7333333333333232,"01:44:00"]
[null,"00:53:00",0.88,1.7666666666666544,"01:46:00"]
[null,"00:54:00",0.9,1.7999999999999856,"01:48:00"]
[null,"00:55:00",0.92,1.8333333333333168,"01:50:00"]
[null,"00:56:00",0.93,1.866666666666648,{"$f":"B85*2","v":"01:52:00"}]
[null,"00:57:00",0.95,1.8999999999999793,"01:54:00"]
[null,"00:58:00",0.97,1.9333333333333105,"01:56:00"]
[null,"00:59:00",0.98,1.9666666666666417,"01:58:00"]
[null,"01:00:00",1,1.9999999999999729,"02:00:00"]
[null,"01:01:00",{"$f":"1+C30","v":1.02},2.0333333333333039,"02:02:00"]
[null,"01:02:00",{"$f":"1+C31","v":1.03},2.0666666666666353,{"$f":"B91*2","v":"02:04:00"}]
[null,"01:03:00",{"$f":"1+C32","v":1.05},2.0999999999999668,"02:06:00"]
[null,"01:04:00",1.07,{"$f":"E93*24","v":2.1333333333332973},"02:08:00"]
[null,"01:05:00",1.08,2.1666666666666288,"02:10:00"]
[null,"01:06:00",1.1000000000000001,2.1999999999999598,"02:12:00"]
[null,"01:07:00",1.1200000000000001,2.2333333333332912,"02:14:00"]
[null,"01:08:00",1.1299999999999999,2.2666666666666222,"02:16:00"]
[null,"01:09:00",1.1499999999999999,2.2999999999999536,"02:18:00"]
[null,"01:10:00",1.17,2.3333333333332846,"02:20:00"]
[null,"01:11:00",1.18,2.3666666666666161,"02:22:00"]
[null,"01:12:00",1.2,2.3999999999999471,"02:24:00"]
[null,"01:13:00",1.22,2.4333333333332785,"02:26:00"]
[null,"01:14:00",1.23,2.4666666666666095,"02:28:00"]
[null,"01:15:00",1.25,2.4999999999999409,"02:30:00"]
[null,"01:16:00",1.27,2.5333333333332719,"02:32:00"]
[null,"01:17:00",1.28,2.5666666666666034,"02:34:00"]
[null,"01:18:00",1.3,2.5999999999999344,"02:36:00"]
[null,"01:19:00",1.32,2.6333333333332658,"02:38:00"]
[null,"01:20:00",1.33,2.6666666666665968,"02:40:00"]
[null,"01:21:00",1.35,2.6999999999999282,"02:42:00"]
[null,"01:22:00",1.37,2.7333333333332592,"02:44:00"]
[null,"01:23:00",1.38,2.7666666666665907,"02:46:00"]
[null,"01:24:00",1.4,2.7999999999999217,"02:48:00"]
[null,"01:25:00",1.42,2.8333333333332527,"02:50:00"]
[null,"01:26:00",1.43,2.8666666666665837,"02:52:00"]
[null,"01:27:00",1.45,2.8999999999999151,"02:54:00"]
[null,"01:28:00",1.47,2.9333333333332465,"02:56:00"]
[null,"01:29:00",1.48,2.9666666666665775,"02:58:00"]
[null,"01:30:00",1.5,2.9999999999999085,"03:00:00"]
[null,"01:31:00",1.52,3.03333333333324,"03:02:00"]
[null,"01:32:00",1.53,3.0666666666665714,"03:04:00"]
[null,"01:33:00",1.55,3.0999999999999024,"03:06:00"]
[null,"01:34:00",1.5699999999999998,3.1333333333332334,"03:08:00"]
[null,"01:35:00",1.58,3.1666666666665648,"03:10:00"]
[null,"01:36:00",1.6,3.1999999999998963,"03:12:00"]
[null,"01:37:00",1.62,3.2333333333332273,"03:14:00"]
[null,"01:38:00",1.63,3.2666666666665582,"03:16:00"]
[null,"01:39:00",1.65,3.2999999999998897,"03:18:00"]
[null,"01:40:00",1.67,3.3333333333332211,"03:20:00"]
[null,"01:41:00",1.6800000000000002,3.3666666666665521,"03:22:00"]
[null,"01:42:00",1.7,3.3999999999998831,"03:24:00"]
[null,"01:43:00",1.72,3.4333333333332146,"03:26:00"]
[null,"01:44:00",1.73,3.466666666666546,"03:28:00"]
[null,"01:45:00",1.75,3.499999999999877,"03:30:00"]
[null,"01:46:00",1.77,3.533333333333208,"03:32:00"]
[null,"01:47:00",1.78,3.5666666666665394,"03:34:00"]
[null,"01:48:00",1.8,3.5999999999998709,"03:36:00"]
[null,"01:49:00",1.8199999999999998,3.6333333333332019,"03:38:00"]
[null,"01:50:00",1.83,3.6666666666665328,"03:40:00"]
[null,"01:51:00",1.85,3.6999999999998643,"03:42:00"]
[null,"01:52:00",1.87,3.7333333333331957,"03:44:00"]
[null,"01:53:00",1.88,3.7666666666665267,"03:46:00"]
[null,"01:54:00",1.9,3.7999999999998573,"03:48:00"]
[null,"01:55:00",1.92,3.8333333333331883,"03:50:00"]
[null,"01:56:00",1.9300000000000002,3.8666666666665197,"03:52:00"]
[null,"01:57:00",1.95,3.8999999999998511,"03:54:00"]
[null,"01:58:00",1.97,3.9333333333331821,"03:56:00"]
[null,"01:59:00",1.98,3.9666666666665131,"03:58:00"]
[null,"02:00:00",2,3.9999999999998446,"04:00:00"]
[null,"02:01:00",{"$f":"2+C30","v":2.02},4.033333333333176,"04:02:00"]
[null,"02:02:00",{"$f":"2+C31","v":2.0299999999999998},4.0666666666665066,"04:04:00"]
[null,"02:03:00",{"$f":"2+C32","v":2.0499999999999998},4.099999999999838,"04:06:00"]
[null,"02:04:00",2.0699999999999998,4.1333333333331694,"04:08:00"]
[null,"02:05:00",2.08,4.1666666666665009,"04:10:00"]
[null,"02:06:00",2.1,4.1999999999998323,{"$f":"B155*2","v":"04:12:00"}]
[null,"02:07:00",2.12,4.2333333333331629,"04:14:00"]
[null,"02:08:00",2.13,{"$f":"E157*24","v":4.2666666666664943},"04:16:00"]
[null,"02:09:00",2.15,4.2999999999998257,"04:18:00"]
[null,"02:10:00",2.17,4.3333333333331563,"04:20:00"]
[null,"02:11:00",2.1800000000000002,4.3666666666664877,"04:22:00"]
[null,"02:12:00",2.2000000000000002,4.3999999999998192,"04:24:00"]
[null,"02:13:00",2.2200000000000002,4.4333333333331506,"04:26:00"]
[null,"02:14:00",2.23,4.466666666666482,"04:28:00"]
[null,"02:15:00",2.25,4.4999999999998126,"04:30:00"]
[null,"02:16:00",2.27,4.533333333333144,"04:32:00"]
[null,"02:17:00",2.2800000000000002,4.5666666666664755,"04:34:00"]
[null,"02:18:00",2.2999999999999998,4.599999999999806,"04:36:00"]
[null,"02:19:00",2.3199999999999998,4.6333333333331375,"04:38:00"]
[null,"02:20:00",2.33,4.6666666666664689,"04:40:00"]
[null,"02:21:00",2.35,4.6999999999998003,"04:42:00"]
[null,"02:22:00",2.37,4.7333333333331318,"04:44:00"]
[null,"02:23:00",2.38,4.7666666666664623,"04:46:00"]
[null,"02:24:00",2.4,4.7999999999997938,"04:48:00"]
[null,"02:25:00",2.42,4.8333333333331208,"04:50:00"]
[null,"02:26:00",2.4300000000000002,4.8666666666664806,"04:52:00"]
[null,"02:27:00",2.4500000000000002,4.8999999999997925,"04:54:00"]
[null,"02:28:00",2.4699999999999998,4.9333333333331044,"04:56:00"]
[null,"02:29:00",2.48,4.9666666666664643,"04:58:00"]
[null,"02:30:00",2.5,4.9999999999997762,"05:00:00"]
[null,"02:31:00",2.52,5.0333333333330881,"05:02:00"]
[null,"02:32:00",2.5300000000000002,5.0666666666664479,"05:04:00"]
[null,"02:33:00",2.5499999999999998,5.0999999999997598,"05:06:00"]
[null,"02:34:00",2.57,5.1333333333331197,"05:08:00"]
[null,"02:35:00",2.58,5.1666666666664316,"05:10:00"]
[null,"02:36:00",2.6,5.1999999999997435,"05:12:00"]
[null,"02:37:00",2.62,5.2333333333331042,"05:14:00"]
[null,"02:38:00",2.63,5.2666666666664161,"05:16:00"]
[null,"02:39:00",2.65,5.299999999999776,"05:18:00"]
[null,"02:40:00",2.67,5.3333333333330879,"05:20:00"]
[null,"02:41:00",2.68,5.3666666666663998,"05:22:00"]
[null,"02:42:00",2.7,5.3999999999997605,"05:24:00"]
[null,"02:43:00",2.7199999999999998,5.4333333333330724,"05:26:00"]
[null,"02:44:00",2.73,5.4666666666664323,"05:28:00"]
[null,"02:45:00",2.75,5.4999999999997442,"05:30:00"]
[null,"02:46:00",2.77,5.5333333333330561,"05:32:00"]
[null,"02:47:00",2.7800000000000002,5.566666666666416,"05:34:00"]
[null,"02:48:00",2.8,5.5999999999997279,"05:36:00"]
[null,"02:49:00",2.82,5.6333333333330877,"05:38:00"]
[null,"02:50:00",2.83,5.6666666666663996,"05:40:00"]
[null,"02:51:00",2.85,5.6999999999997115,"05:42:00"]
[null,"02:52:00",2.87,5.7333333333330714,"05:44:00"]
[null,"02:53:00",2.88,5.7666666666663833,"05:46:00"]
[null,"02:54:00",2.9,5.799999999999744,"05:48:00"]
[null,"02:55:00",2.92,5.8333333333330559,"05:50:00"]
[null,"02:56:00",2.93,5.8666666666664158,"05:52:00"]
[null,"02:57:00",2.95,5.8999999999997277,"05:54:00"]
[null,"02:58:00",2.9699999999999998,5.9333333333330396,"05:56:00"]
[null,"02:59:00",2.98,5.9666666666664003,"05:58:00"]
[null,"03:00:00",{"$f":"3+C29","v":3},5.9999999999997122,"06:00:00"]
[null,"03:01:00",{"$f":"3+C30","v":3.02},6.0333333333330721,"06:02:00"]
[null,"03:02:00",{"$f":"3+C31","v":3.03},6.066666666666384,"06:04:00"]
[null,"03:03:00",3.05,6.0999999999996959,"06:06:00"]
[null,"03:04:00",3.07,6.1333333333330557,"06:08:00"]
[null,"03:05:00",3.08,6.1666666666663676,"06:10:00"]
[null,"03:06:00",3.1,6.1999999999996795,"06:12:00"]
[null,"03:07:00",3.12,6.2333333333330394,"06:14:00"]
[null,"03:08:00",3.13,6.2666666666663531,"06:16:00"]
[null,"03:09:00",3.15,6.2999999999997129,"06:18:00"]
[null,"03:10:00",3.17,6.3333333333330248,{"$f":"B219*2","v":"06:20:00"}]
[null,"03:11:00",3.18,6.3666666666663367,"06:22:00"]
[null,"03:12:00",3.2,{"$f":"E221*24","v":6.3999999999996966},"06:24:00"]
[null,"03:13:00",3.22,6.4333333333330085,"06:26:00"]
[null,"03:14:00",3.23,6.4666666666663204,"06:28:00"]
[null,"03:15:00",3.25,6.4999999999996803,"06:30:00"]
[null,"03:16:00",3.27,6.5333333333329922,"06:32:00"]
[null,"03:17:00",3.2800000000000002,6.566666666666352,"06:34:00"]
[null,"03:18:00",3.3,6.5999999999996639,"06:36:00"]
[null,"03:19:00",3.32,6.6333333333329758,"06:38:00"]
[null,"03:20:00",3.33,6.6666666666663366,"06:40:00"]
[null,"03:21:00",3.35,6.6999999999996485,"06:42:00"]
[null,"03:22:00",3.37,6.7333333333330083,"06:44:00"]
[null,"03:23:00",3.38,6.7666666666663202,"06:46:00"]
[null,"03:24:00",3.4,6.7999999999996321,"06:48:00"]
[null,"03:25:00",3.42,6.833333333332992,"06:50:00"]
[null,"03:26:00",3.43,6.8666666666663039,"06:52:00"]
[null,"03:27:00",3.45,6.8999999999996637,"06:54:00"]
[null,"03:28:00",3.4699999999999998,6.9333333333329756,"06:56:00"]
[null,"03:29:00",3.48,6.9666666666662875,"06:58:00"]
[null,"03:30:00",3.5,6.9999999999996474,"07:00:00"]
[null,"03:31:00",3.52,7.0333333333329602,"07:02:00"]
[null,"03:32:00",3.5300000000000002,7.06666666666632,"07:04:00"]
[null,"03:33:00",3.55,7.0999999999996319,"07:06:00"]
[null,"03:34:00",3.57,7.1333333333329438,"07:08:00"]
[null,"03:35:00",3.58,7.1666666666663037,"07:10:00"]
[null,"03:36:00",3.6,7.1999999999996156,"07:12:00"]
[null,"03:37:00",3.62,7.2333333333329755,"07:14:00"]
[null,"03:38:00",3.63,7.2666666666662874,"07:16:00"]
[null,"03:39:00",3.65,7.2999999999995993,"07:18:00"]
[null,"03:40:00",3.67,7.3333333333329591,"07:20:00"]
[null,"03:41:00",3.68,7.366666666666271,"07:22:00"]
[null,"03:42:00",3.7,7.3999999999996326,"07:24:00"]
[null,"03:43:00",3.7199999999999998,7.4333333333329445,"07:26:00"]
[null,"03:44:00",3.73,7.4666666666662564,"07:28:00"]
[null,"03:45:00",3.75,7.4999999999996163,"07:30:00"]
[null,"03:46:00",3.77,7.5333333333329282,"07:32:00"]
[null,"03:47:00",3.7800000000000002,7.5666666666662881,"07:34:00"]
[null,"03:48:00",3.8,7.5999999999996,"07:36:00"]
[null,"03:49:00",3.82,7.6333333333329119,"07:38:00"]
[null,"03:50:00",3.83,7.6666666666662717,"07:40:00"]
[null,"03:51:00",3.85,7.6999999999995836,"07:42:00"]
[null,"03:52:00",3.87,7.7333333333329435,"07:44:00"]
[null,"03:53:00",3.88,7.7666666666662554,"07:46:00"]
[null,"03:54:00",3.9,7.7999999999995691,"07:48:00"]
[null,"03:55:00",3.92,7.8333333333329289,"07:50:00"]
[null,"03:56:00",3.93,7.8666666666662408,"07:52:00"]
[null,"03:57:00",3.95,7.8999999999996007,"07:54:00"]
[null,"03:58:00",3.9699999999999998,7.9333333333329126,"07:56:00"]
[null,"03:59:00",3.98,7.9666666666662245,"07:58:00"]
[null,"04:00:00",{"$f":"4+C29","v":4},7.9999999999995843,"08:00:00"]
[null,"04:01:00",{"$f":"4+C30","v":4.0199999999999996},8.0333333333328962,"08:02:00"]
[null,"04:02:00",4.03,8.0666666666662561,"08:04:00"]
[null,"04:03:00",4.05,8.099999999999568,"08:06:00"]
[null,"04:04:00",4.07,8.1333333333328799,"08:08:00"]
[null,"04:05:00",4.08,8.1666666666662415,"08:10:00"]
[null,"04:06:00",4.0999999999999996,8.1999999999995516,"08:12:00"]
[null,"04:07:00",4.12,8.2333333333329115,"08:14:00"]
[null,"04:08:00",4.13,8.2666666666662252,"08:16:00"]
[null,"04:09:00",4.1500000000000004,8.2999999999995353,"08:18:00"]
[null,"04:10:00",4.17,8.3333333333328952,"08:20:00"]
[null,"04:11:00",4.18,8.3666666666662088,"08:22:00"]
[null,"04:12:00",4.2,8.3999999999995687,"08:24:00"]
[null,"04:13:00",4.22,8.4333333333328788,"08:26:00"]
[null,"04:14:00",4.2300000000000004,8.4666666666661925,{"$f":"B283*2","v":"08:28:00"}]
[null,"04:15:00",4.25,8.4999999999995524,"08:30:00"]
[null,"04:16:00",4.2699999999999996,{"$f":"E285*24","v":8.5333333333328625},"08:32:00"]
[null,"04:17:00",4.28,8.5666666666662241,"08:34:00"]
[null,"04:18:00",4.3,8.599999999999536,"08:36:00"]
[null,"04:19:00",4.32,8.6333333333328479,"08:38:00"]
[null,"04:20:00",4.33,8.6666666666662078,"08:40:00"]
[null,"04:21:00",4.3499999999999996,8.6999999999995197,"08:42:00"]
[null,"04:22:00",4.37,8.7333333333328795,"08:44:00"]
[null,"04:23:00",4.38,8.7666666666661914,"08:46:00"]
[null,"04:24:00",4.4000000000000004,8.7999999999995033,"08:48:00"]
[null,"04:25:00",4.42,8.8333333333328632,"08:50:00"]
[null,"04:26:00",4.43,8.8666666666661751,"08:52:00"]
[null,"04:27:00",4.45,8.8999999999995349,"08:54:00"]
[null,"04:28:00",4.47,8.9333333333328486,"08:56:00"]
[null,"04:29:00",4.4800000000000004,8.9666666666661605,"08:58:00"]
[null,"04:30:00",4.5,8.9999999999995204,"09:00:00"]
[null,"04:31:00",4.5199999999999996,9.0333333333328323,"09:02:00"]
[null,"04:32:00",4.53,9.0666666666661921,"09:04:00"]
[null,"04:33:00",4.55,9.099999999999504,"09:06:00"]
[null,"04:34:00",4.57,9.1333333333328159,"09:08:00"]
[null,"04:35:00",4.58,9.1666666666661758,"09:10:00"]
[null,"04:36:00",4.5999999999999996,9.1999999999994877,"09:12:00"]
[null,"04:37:00",4.62,9.2333333333328476,"09:14:00"]
[null,"04:38:00",4.63,9.2666666666661595,"09:16:00"]
[null,"04:39:00",4.6500000000000004,9.2999999999994714,"09:18:00"]
[null,"04:40:00",4.67,9.333333333332833,"09:20:00"]
[null,"04:41:00",4.68,9.3666666666661449,"09:22:00"]
[null,"04:42:00",4.7,9.3999999999995048,"09:24:00"]
[null,"04:43:00",4.72,9.4333333333328167,"09:26:00"]
[null,"04:44:00",4.7300000000000004,9.4666666666661285,"09:28:00"]
[null,"04:45:00",4.75,9.4999999999994884,"09:30:00"]
[null,"04:46:00",4.7699999999999996,9.5333333333328003,"09:32:00"]
[null,"04:47:00",4.78,9.5666666666661602,"09:34:00"]
[null,"04:48:00",4.8,9.5999999999994721,"09:36:00"]
[null,"04:49:00",4.82,9.633333333332784,"09:38:00"]
[null,"04:50:00",4.83,9.6666666666661438,"09:40:00"]
[null,"04:51:00",4.8499999999999996,9.6999999999994557,"09:42:00"]
[null,"04:52:00",4.87,9.7333333333328156,"09:44:00"]
[null,"04:53:00",4.88,9.7666666666661293,"09:46:00"]
[null,"04:54:00",4.9000000000000004,9.7999999999994394,"09:48:00"]
[null,"04:55:00",4.92,9.8333333333327992,"09:50:00"]
[null,"04:56:00",4.93,9.8666666666661129,"09:52:00"]
[null,"04:57:00",4.95,9.8999999999994728,"09:54:00"]
[null,"04:58:00",4.97,9.9333333333327829,"09:56:00"]
[null,"04:59:00",4.9800000000000004,9.9666666666661428,"09:58:00"]
[null,"05:00:00",{"$f":"5+C29","v":5},9.9999999999994564,"10:00:00"]
[null,"05:01:00",{"$f":"5+C30","v":5.0199999999999996},10.033333333332767,"10:02:00"]
[null,"05:02:00",5.03,10.066666666666128,"10:04:00"]
[null,"05:03:00",5.05,10.09999999999944,"10:06:00"]
[null,"05:04:00",5.07,10.133333333332752,"10:08:00"]
[null,"05:05:00",5.08,10.166666666666112,"10:10:00"]
[null,"05:06:00",5.0999999999999996,10.199999999999424,"10:12:00"]
[null,"05:07:00",5.12,10.233333333332784,"10:14:00"]
[null,"05:08:00",5.13,10.266666666666096,"10:16:00"]
[null,"05:09:00",5.15,10.299999999999407,"10:18:00"]
[null,"05:10:00",5.17,10.333333333332767,"10:20:00"]
[null,"05:11:00",5.18,10.366666666666079,"10:22:00"]
[null,"05:12:00",5.2,10.399999999999439,"10:24:00"]
[null,"05:13:00",5.22,10.433333333332751,"10:26:00"]
[null,"05:14:00",5.23,10.466666666666065,"10:28:00"]
[null,"05:15:00",5.25,10.499999999999424,"10:30:00"]
[null,"05:16:00",5.27,10.533333333332736,"10:32:00"]
[null,"05:17:00",5.28,10.566666666666096,"10:34:00"]
[null,"05:18:00",5.3,10.599999999999408,{"$f":"B347*2","v":"10:36:00"}]
[null,"05:19:00",5.32,10.633333333332768,"10:38:00"]
[null,"05:20:00",5.33,{"$f":"E349*24","v":10.66666666666608},"10:40:00"]
[null,"05:21:00",5.35,10.699999999999392,"10:42:00"]
[null,"05:22:00",5.37,10.733333333332752,"10:44:00"]
[null,"05:23:00",5.38,10.766666666666064,"10:46:00"]
[null,"05:24:00",5.4,10.799999999999375,"10:48:00"]
[null,"05:25:00",5.42,10.833333333332737,"10:50:00"]
[null,"05:26:00",5.43,10.866666666666049,"10:52:00"]
[null,"05:27:00",5.45,10.899999999999409,"10:54:00"]
[null,"05:28:00",5.47,10.933333333332721,"10:56:00"]
[null,"05:29:00",5.48,10.966666666666033,"10:58:00"]
[null,"05:30:00",5.5,10.999999999999392,"11:00:00"]
[null,"05:31:00",5.52,11.033333333332704,"11:02:00"]
[null,"05:32:00",5.53,11.066666666666064,"11:04:00"]
[null,"05:33:00",5.55,11.099999999999376,"11:06:00"]
[null,"05:34:00",5.57,11.133333333332688,"11:08:00"]
[null,"05:35:00",5.58,11.166666666666048,"11:10:00"]
[null,"05:36:00",5.6,11.19999999999936,"11:12:00"]
[null,"05:37:00",5.62,11.23333333333272,"11:14:00"]
[null,"05:38:00",5.63,11.266666666666033,"11:16:00"]
[null,"05:39:00",5.65,11.299999999999393,"11:18:00"]
[null,"05:40:00",5.67,11.333333333332703,"11:20:00"]
[null,"05:41:00",5.68,11.366666666666017,"11:22:00"]
[null,"05:42:00",5.7,11.399999999999377,"11:24:00"]
[null,"05:43:00",5.72,11.433333333332687,"11:26:00"]
[null,"05:44:00",5.73,11.466666666666047,"11:28:00"]
[null,"05:45:00",5.75,11.499999999999361,"11:30:00"]
[null,"05:46:00",5.77,11.533333333332671,"11:32:00"]
[null,"05:47:00",5.78,11.56666666666603,"11:34:00"]
[null,"05:48:00",5.8,11.599999999999344,"11:36:00"]
[null,"05:49:00",5.82,11.633333333332656,"11:38:00"]
[null,"05:50:00",5.83,11.666666666666016,"11:40:00"]
[null,"05:51:00",5.85,11.699999999999328,"11:42:00"]
[null,"05:52:00",5.87,11.733333333332688,"11:44:00"]
[null,"05:53:00",5.88,11.766666666666,"11:46:00"]
[null,"05:54:00",5.9,11.799999999999359,"11:48:00"]
[null,"05:55:00",5.92,11.833333333332671,"11:50:00"]
[null,"05:56:00",5.93,11.866666666665983,"11:52:00"]
[null,"05:57:00",5.95,11.899999999999343,"11:54:00"]
[null,"05:58:00",5.97,11.933333333332655,"11:56:00"]
[null,"05:59:00",5.98,11.966666666666017,"11:58:00"]
[null,"06:00:00",{"$f":"6+C29","v":6},11.999999999999329,"12:00:00"]
[null,"06:01:00",{"$f":"6+C30","v":6.02},12.03333333333264,"12:02:00"]
[null,"06:02:00",6.03,12.066666666666,"12:04:00"]
[null,"06:03:00",6.05,12.099999999999312,"12:06:00"]
[null,"06:04:00",6.07,12.133333333332672,"12:08:00"]
[null,"06:05:00",6.08,12.166666666665984,"12:10:00"]
[null,"06:06:00",6.1,12.199999999999296,"12:12:00"]
[null,"06:07:00",6.12,12.233333333332656,"12:14:00"]
[null,"06:08:00",6.13,12.266666666665968,"12:16:00"]
[null,"06:09:00",6.15,12.29999999999928,"12:18:00"]
[null,"06:10:00",6.17,12.333333333332639,"12:20:00"]
[null,"06:11:00",6.18,12.366666666665951,"12:22:00"]
[null,"06:12:00",6.2,12.399999999999311,"12:24:00"]
[null,"06:13:00",6.22,12.433333333332623,"12:26:00"]
[null,"06:14:00",6.23,12.466666666665983,"12:28:00"]
[null,"06:15:00",6.25,12.499999999999295,"12:30:00"]
[null,"06:16:00",6.27,12.533333333332607,"12:32:00"]
[null,"06:17:00",6.28,12.56666666666597,"12:34:00"]
[null,"06:18:00",6.3,12.59999999999928,"12:36:00"]
[null,"06:19:00",6.32,12.63333333333264,"12:38:00"]
[null,"06:20:00",6.33,12.666666666665954,"12:40:00"]
[null,"06:21:00",6.35,12.699999999999264,"12:42:00"]
[null,"06:22:00",6.37,12.733333333332624,{"$f":"B411*2","v":"12:44:00"}]
[null,"06:23:00",6.38,12.766666666665937,"12:46:00"]
[null,"06:24:00",6.4,{"$f":"E413*24","v":12.799999999999297},"12:48:00"]
[null,"06:25:00",6.42,12.833333333332607,"12:50:00"]
[null,"06:26:00",6.43,12.866666666665921,"12:52:00"]
[null,"06:27:00",6.45,12.899999999999281,"12:54:00"]
[null,"06:28:00",6.47,12.933333333332591,"12:56:00"]
[null,"06:29:00",6.48,12.966666666665951,"12:58:00"]
[null,"06:30:00",6.5,12.999999999999265,"13:00:00"]
[null,"06:31:00",6.52,13.033333333332575,"13:02:00"]
[null,"06:32:00",6.53,13.066666666665935,"13:04:00"]
[null,"06:33:00",6.55,13.099999999999248,"13:06:00"]
[null,"06:34:00",6.57,13.133333333332608,"13:08:00"]
[null,"06:35:00",6.58,13.166666666665918,"13:10:00"]
[null,"06:36:00",6.6,13.199999999999232,"13:12:00"]
[null,"06:37:00",6.62,13.233333333332592,"13:14:00"]
[null,"06:38:00",6.63,13.266666666665902,"13:16:00"]
[null,"06:39:00",6.65,13.299999999999265,"13:18:00"]
[null,"06:40:00",6.67,13.333333333332577,"13:20:00"]
[null,"06:41:00",6.68,13.366666666665889,"13:22:00"]
[null,"06:42:00",6.7,13.399999999999249,"13:24:00"]
[null,"06:43:00",6.72,13.433333333332561,"13:26:00"]
[null,"06:44:00",6.73,13.466666666665921,"13:28:00"]
[null,"06:45:00",6.75,13.499999999999233,"13:30:00"]
[null,"06:46:00",6.77,13.533333333332545,"13:32:00"]
[null,"06:47:00",6.78,13.566666666665904,"13:34:00"]
[null,"06:48:00",6.8,13.599999999999216,"13:36:00"]
[null,"06:49:00",6.82,13.633333333332576,"13:38:00"]
[null,"06:50:00",6.83,13.666666666665888,"13:40:00"]
[null,"06:51:00",6.85,13.6999999999992,"13:42:00"]
[null,"06:52:00",6.87,13.73333333333256,"13:44:00"]
[null,"06:53:00",6.88,13.766666666665872,"13:46:00"]
[null,"06:54:00",6.9,13.799999999999232,"13:48:00"]
[null,"06:55:00",6.92,13.833333333332543,"13:50:00"]
[null,"06:56:00",6.93,13.866666666665855,"13:52:00"]
[null,"06:57:00",6.95,13.899999999999215,"13:54:00"]
[null,"06:58:00",6.97,13.933333333332527,"13:56:00"]
[null,"06:59:00",6.98,13.966666666665887,"13:58:00"]
[null,"07:00:00",{"$f":"7+C29","v":7},13.999999999999199,"14:00:00"]
[null,"07:01:00",{"$f":"7+C30","v":7.02},14.033333333332511,"14:02:00"]
[null,"07:02:00",7.03,14.066666666665874,"14:04:00"]
[null,"07:03:00",7.05,14.099999999999184,"14:06:00"]
[null,"07:04:00",7.07,14.133333333332544,"14:08:00"]
[null,"07:05:00",7.08,14.166666666665858,"14:10:00"]
[null,"07:06:00",7.1,14.199999999999168,"14:12:00"]
[null,"07:07:00",7.12,14.233333333332528,"14:14:00"]
[null,"07:08:00",7.13,14.266666666665841,"14:16:00"]
[null,"07:09:00",7.15,14.299999999999201,"14:18:00"]
[null,"07:10:00",7.17,14.333333333332511,"14:20:00"]
[null,"07:11:00",7.18,14.366666666665825,"14:22:00"]
[null,"07:12:00",7.2,14.399999999999185,"14:24:00"]
[null,"07:13:00",7.22,14.433333333332495,"14:26:00"]
[null,"07:14:00",7.23,14.466666666665855,"14:28:00"]
[null,"07:15:00",7.25,14.499999999999169,"14:30:00"]
[null,"07:16:00",7.27,14.533333333332479,"14:32:00"]
[null,"07:17:00",7.28,14.566666666665839,"14:34:00"]
[null,"07:18:00",7.3,14.599999999999152,"14:36:00"]
[null,"07:19:00",7.32,14.633333333332512,"14:38:00"]
[null,"07:20:00",7.33,14.666666666665822,"14:40:00"]
[null,"07:21:00",7.35,14.699999999999136,"14:42:00"]
[null,"07:22:00",7.37,14.733333333332496,"14:44:00"]
[null,"07:23:00",7.38,14.766666666665806,"14:46:00"]
[null,"07:24:00",7.4,14.799999999999166,"14:48:00"]
[null,"07:25:00",7.42,14.833333333332481,"14:50:00"]
[null,"07:26:00",7.43,14.866666666665793,{"$f":"B475*2","v":"14:52:00"}]
[null,"07:27:00",7.45,14.899999999999153,"14:54:00"]
[null,"07:28:00",7.47,{"$f":"E477*24","v":14.933333333332465},"14:56:00"]
[null,"07:29:00",7.48,14.966666666665825,"14:58:00"]
[null,"07:30:00",7.5,14.999999999999137,"15:00:00"]
[null,"07:31:00",7.52,15.033333333332449,"15:02:00"]
[null,"07:32:00",7.53,15.066666666665808,"15:04:00"]
[null,"07:33:00",7.55,15.09999999999912,"15:06:00"]
[null,"07:34:00",7.57,15.13333333333248,"15:08:00"]
[null,"07:35:00",7.58,15.166666666665792,"15:10:00"]
[null,"07:36:00",7.6,15.199999999999104,"15:12:00"]
[null,"07:37:00",7.62,15.233333333332464,"15:14:00"]
[null,"07:38:00",7.63,15.266666666665776,"15:16:00"]
[null,"07:39:00",7.65,15.299999999999136,"15:18:00"]
[null,"07:40:00",7.67,15.333333333332448,"15:20:00"]
[null,"07:41:00",7.68,15.366666666665759,"15:22:00"]
[null,"07:42:00",7.7,15.399999999999119,"15:24:00"]
[null,"07:43:00",7.72,15.433333333332431,"15:26:00"]
[null,"07:44:00",7.73,15.466666666665791,"15:28:00"]
[null,"07:45:00",7.75,15.499999999999103,"15:30:00"]
[null,"07:46:00",7.77,15.533333333332415,"15:32:00"]
[null,"07:47:00",7.78,15.566666666665775,"15:34:00"]
[null,"07:48:00",7.8,15.599999999999088,"15:36:00"]
[null,"07:49:00",7.82,15.633333333332448,"15:38:00"]
[null,"07:50:00",7.83,15.666666666665762,"15:40:00"]
[null,"07:51:00",7.85,15.699999999999072,"15:42:00"]
[null,"07:52:00",7.87,15.733333333332432,"15:44:00"]
[null,"07:53:00",7.88,15.766666666665746,"15:46:00"]
[null,"07:54:00",7.9,15.799999999999105,"15:48:00"]
[null,"07:55:00",7.92,15.833333333332416,"15:50:00"]
[null,"07:56:00",7.93,15.866666666665729,"15:52:00"]
[null,"07:57:00",7.95,15.899999999999089,"15:54:00"]
[null,"07:58:00",7.97,15.933333333332399,"15:56:00"]
[null,"07:59:00",7.98,15.966666666665759,"15:58:00"]
[null,"08:00:00",{"$f":"8+C29","v":8},15.999999999999073,"16:00:00"]
[null,"08:01:00",{"$f":"8+C30","v":8.02},16.033333333332383,"16:02:00"]
[null,"08:02:00",8.0299999999999994,16.066666666665743,"16:04:00"]
[null,"08:03:00",8.0500000000000007,16.099999999999056,"16:06:00"]
[null,"08:04:00",8.07,16.133333333332416,"16:08:00"]
[null,"08:05:00",8.08,16.166666666665726,"16:10:00"]
[null,"08:06:00",8.1,16.19999999999904,"16:12:00"]
[null,"08:07:00",8.1199999999999992,16.2333333333324,"16:14:00"]
[null,"08:08:00",8.1300000000000008,16.26666666666571,"16:16:00"]
[null,"08:09:00",8.15,16.29999999999907,"16:18:00"]
[null,"08:10:00",8.17,16.333333333332384,"16:20:00"]
[null,"08:11:00",8.18,16.366666666665697,"16:22:00"]
[null,"08:12:00",8.1999999999999993,16.399999999999057,"16:24:00"]
[null,"08:13:00",8.2200000000000006,16.433333333332371,"16:26:00"]
[null,"08:14:00",8.23,16.466666666665731,"16:28:00"]
[null,"08:15:00",8.25,16.499999999999041,"16:30:00"]
[null,"08:16:00",8.27,16.533333333332351,"16:32:00"]
[null,"08:17:00",8.2799999999999994,16.566666666665711,"16:34:00"]
[null,"08:18:00",8.3000000000000007,16.599999999999024,"16:36:00"]
[null,"08:19:00",8.32,16.633333333332384,"16:38:00"]
[null,"08:20:00",8.33,16.666666666665698,"16:40:00"]
[null,"08:21:00",8.35,16.699999999999008,"16:42:00"]
[null,"08:22:00",8.3699999999999992,16.733333333332368,"16:44:00"]
[null,"08:23:00",8.3800000000000008,16.766666666665678,"16:46:00"]
[null,"08:24:00",8.4,16.799999999999038,"16:48:00"]
[null,"08:25:00",8.42,16.833333333332352,"16:50:00"]
[null,"08:26:00",8.43,16.866666666665665,"16:52:00"]
[null,"08:27:00",8.4499999999999993,16.899999999999025,"16:54:00"]
[null,"08:28:00",8.4700000000000006,16.933333333332335,"16:56:00"]
[null,"08:29:00",8.48,16.966666666665695,"16:58:00"]
[null,"08:30:00",8.5,16.999999999999005,{"$f":"B539*2","v":"17:00:00"}]
[null,"08:31:00",8.52,17.033333333332319,"17:02:00"]
[null,"08:32:00",8.5299999999999994,{"$f":"E541*24","v":17.066666666665679},"17:04:00"]
[null,"08:33:00",8.5500000000000007,17.099999999998992,"17:06:00"]
[null,"08:34:00",8.57,17.133333333332352,"17:08:00"]
[null,"08:35:00",8.58,17.166666666665666,"17:10:00"]
[null,"08:36:00",8.6,17.199999999998976,"17:12:00"]
[null,"08:37:00",8.6199999999999992,17.233333333332336,"17:14:00"]
[null,"08:38:00",8.6300000000000008,17.26666666666565,"17:16:00"]
[null,"08:39:00",8.65,17.29999999999901,"17:18:00"]
[null,"08:40:00",8.67,17.33333333333232,"17:20:00"]
[null,"08:41:00",8.68,17.366666666665633,"17:22:00"]
[null,"08:42:00",8.6999999999999993,17.399999999998993,"17:24:00"]
[null,"08:43:00",8.7200000000000006,17.433333333332303,"17:26:00"]
[null,"08:44:00",8.73,17.466666666665663,"17:28:00"]
[null,"08:45:00",8.75,17.499999999998977,"17:30:00"]
[null,"08:46:00",8.77,17.533333333332287,"17:32:00"]
[null,"08:47:00",8.7799999999999994,17.566666666665647,"17:34:00"]
[null,"08:48:00",8.8000000000000007,17.59999999999896,"17:36:00"]
[null,"08:49:00",8.82,17.63333333333232,"17:38:00"]
[null,"08:50:00",8.83,17.66666666666563,"17:40:00"]
[null,"08:51:00",8.85,17.699999999998944,"17:42:00"]
[null,"08:52:00",8.8699999999999992,17.733333333332304,"17:44:00"]
[null,"08:53:00",8.8800000000000008,17.766666666665614,"17:46:00"]
[null,"08:54:00",8.9,17.799999999998974,"17:48:00"]
[null,"08:55:00",8.92,17.833333333332288,"17:50:00"]
[null,"08:56:00",8.93,17.866666666665601,"17:52:00"]
[null,"08:57:00",8.9499999999999993,17.899999999998961,"17:54:00"]
[null,"08:58:00",8.9700000000000006,17.933333333332271,"17:56:00"]
[null,"08:59:00",8.98,17.966666666665631,"17:58:00"]
[null,"09:00:00",{"$f":"9+C29","v":9},17.999999999998945,"18:00:00"]
[null,"09:01:00",{"$f":"9+C30","v":9.02},18.033333333332259,"18:02:00"]
[null,"09:02:00",9.0299999999999994,18.066666666665618,"18:04:00"]
[null,"09:03:00",9.0500000000000007,18.099999999998929,"18:06:00"]
[null,"09:04:00",9.07,18.133333333332288,"18:08:00"]
[null,"09:05:00",9.08,18.166666666665598,"18:10:00"]
[null,"09:06:00",9.1,18.199999999998912,"18:12:00"]
[null,"09:07:00",9.1199999999999992,18.233333333332272,"18:14:00"]
[null,"09:08:00",9.1300000000000008,18.266666666665586,"18:16:00"]
[null,"09:09:00",9.15,18.299999999998946,"18:18:00"]
[null,"09:10:00",9.17,18.333333333332256,"18:20:00"]
[null,"09:11:00",9.18,18.366666666665566,"18:22:00"]
[null,"09:12:00",9.1999999999999993,18.399999999998926,"18:24:00"]
[null,"09:13:00",9.2200000000000006,18.433333333332239,"18:26:00"]
[null,"09:14:00",9.23,18.466666666665599,"18:28:00"]
[null,"09:15:00",9.25,18.499999999998913,"18:30:00"]
[null,"09:16:00",9.27,18.533333333332223,"18:32:00"]
[null,"09:17:00",9.2799999999999994,18.566666666665583,"18:34:00"]
[null,"09:18:00",9.3000000000000007,18.599999999998893,"18:36:00"]
[null,"09:19:00",9.32,18.633333333332256,"18:38:00"]
[null,"09:20:00",9.33,18.66666666666557,"18:40:00"]
[null,"09:21:00",9.35,18.69999999999888,"18:42:00"]
[null,"09:22:00",9.3699999999999992,18.73333333333224,"18:44:00"]
[null,"09:23:00",9.3800000000000008,18.766666666665554,"18:46:00"]
[null,"09:24:00",9.4,18.799999999998914,"18:48:00"]
[null,"09:25:00",9.42,18.833333333332224,"18:50:00"]
[null,"09:26:00",9.43,18.866666666665537,"18:52:00"]
[null,"09:27:00",9.4499999999999993,18.899999999998897,"18:54:00"]
[null,"09:28:00",9.4700000000000006,18.933333333332207,"18:56:00"]
[null,"09:29:00",9.48,18.966666666665567,"18:58:00"]
[null,"09:30:00",9.5,18.999999999998881,"19:00:00"]
[null,"09:31:00",9.52,19.033333333332191,"19:02:00"]
[null,"09:32:00",9.5299999999999994,19.066666666665551,"19:04:00"]
[null,"09:33:00",9.5500000000000007,19.099999999998865,"19:06:00"]
[null,"09:34:00",9.57,19.133333333332224,{"$f":"B603*2","v":"19:08:00"}]
[null,"09:35:00",9.58,19.166666666665535,"19:10:00"]
[null,"09:36:00",9.6,{"$f":"E605*24","v":19.199999999998848},"19:12:00"]
[null,"09:37:00",9.6199999999999992,19.233333333332208,"19:14:00"]
[null,"09:38:00",9.6300000000000008,19.266666666665518,"19:16:00"]
[null,"09:39:00",9.65,19.299999999998878,"19:18:00"]
[null,"09:40:00",9.67,19.333333333332192,"19:20:00"]
[null,"09:41:00",9.68,19.366666666665502,"19:22:00"]
[null,"09:42:00",9.6999999999999993,19.399999999998865,"19:24:00"]
[null,"09:43:00",9.7200000000000006,19.433333333332179,"19:26:00"]
[null,"09:44:00",9.73,19.466666666665539,"19:28:00"]
[null,"09:45:00",9.75,19.499999999998849,"19:30:00"]
[null,"09:46:00",9.77,19.533333333332159,"19:32:00"]
[null,"09:47:00",9.7799999999999994,19.566666666665519,"19:34:00"]
[null,"09:48:00",9.8000000000000007,19.599999999998833,"19:36:00"]
[null,"09:49:00",9.82,19.633333333332192,"19:38:00"]
[null,"09:50:00",9.83,19.666666666665506,"19:40:00"]
[null,"09:51:00",9.85,19.699999999998816,"19:42:00"]
[null,"09:52:00",9.8699999999999992,19.733333333332176,"19:44:00"]
[null,"09:53:00",9.8800000000000008,19.766666666665486,"19:46:00"]
[null,"09:54:00",9.9,19.799999999998846,"19:48:00"]
[null,"09:55:00",9.92,19.83333333333216,"19:50:00"]
[null,"09:56:00",9.93,19.866666666665473,"19:52:00"]
[null,"09:57:00",9.9499999999999993,19.899999999998833,"19:54:00"]
[null,"09:58:00",9.9700000000000006,19.933333333332143,"19:56:00"]
[null,"09:59:00",9.98,19.966666666665503,"19:58:00"]
[null,"10:00:00",{"$f":"10+C29","v":10},19.999999999998813,"20:00:00"]
[null,"10:01:00",{"$f":"10+C30","v":10.02},20.033333333332127,"20:02:00"]
[null,"10:02:00",10.029999999999999,20.066666666665487,"20:04:00"]
[null,"10:03:00",10.050000000000001,20.099999999998801,"20:06:00"]
[null,"10:04:00",10.07,20.13333333333216,"20:08:00"]
[null,"10:05:00",10.08,20.166666666665474,"20:10:00"]
[null,"10:06:00",10.1,20.199999999998784,"20:12:00"]
[null,"10:07:00",10.119999999999999,20.233333333332144,"20:14:00"]
[null,"10:08:00",10.130000000000001,20.266666666665458,"20:16:00"]
[null,"10:09:00",10.15,20.299999999998818,"20:18:00"]
[null,"10:10:00",10.17,20.333333333332128,"20:20:00"]
[null,"10:11:00",10.18,20.366666666665441,"20:22:00"]
[null,"10:12:00",10.199999999999999,20.399999999998801,"20:24:00"]
[null,"10:13:00",10.220000000000001,20.433333333332111,"20:26:00"]
[null,"10:14:00",10.23,20.466666666665471,"20:28:00"]
[null,"10:15:00",10.25,20.499999999998785,"20:30:00"]
[null,"10:16:00",10.27,20.533333333332095,"20:32:00"]
[null,"10:17:00",10.28,20.566666666665455,"20:34:00"]
[null,"10:18:00",10.3,20.599999999998769,"20:36:00"]
[null,"10:19:00",10.32,20.633333333332128,"20:38:00"]
[null,"10:20:00",10.33,20.666666666665439,"20:40:00"]
[null,"10:21:00",10.35,20.699999999998752,"20:42:00"]
[null,"10:22:00",10.37,20.733333333332112,"20:44:00"]
[null,"10:23:00",10.38,20.766666666665422,"20:46:00"]
[null,"10:24:00",10.4,20.799999999998782,"20:48:00"]
[null,"10:25:00",10.42,20.833333333332096,"20:50:00"]
[null,"10:26:00",10.43,20.866666666665406,"20:52:00"]
[null,"10:27:00",10.45,20.899999999998766,"20:54:00"]
[null,"10:28:00",10.47,20.933333333332079,"20:56:00"]
[null,"10:29:00",10.48,20.966666666665439,"20:58:00"]
[null,"10:30:00",10.5,20.999999999998753,"21:00:00"]
[null,"10:31:00",10.52,21.033333333332067,"21:02:00"]
[null,"10:32:00",10.53,21.066666666665427,"21:04:00"]
[null,"10:33:00",10.55,21.099999999998737,"21:06:00"]
[null,"10:34:00",10.57,21.133333333332097,"21:08:00"]
[null,"10:35:00",10.58,21.166666666665407,"21:10:00"]
[null,"10:36:00",10.6,21.19999999999872,"21:12:00"]
[null,"10:37:00",10.62,21.23333333333208,"21:14:00"]
[null,"10:38:00",10.63,21.266666666665394,{"$f":"B667*2","v":"21:16:00"}]
[null,"10:39:00",10.65,21.299999999998754,"21:18:00"]
[null,"10:40:00",10.67,{"$f":"E669*24","v":21.333333333332064},"21:20:00"]
[null,"10:41:00",10.68,21.366666666665374,"21:22:00"]
[null,"10:42:00",10.7,21.399999999998734,"21:24:00"]
[null,"10:43:00",10.72,21.433333333332047,"21:26:00"]
[null,"10:44:00",10.73,21.466666666665407,"21:28:00"]
[null,"10:45:00",10.75,21.499999999998721,"21:30:00"]
[null,"10:46:00",10.77,21.533333333332031,"21:32:00"]
[null,"10:47:00",10.78,21.566666666665391,"21:34:00"]
[null,"10:48:00",10.8,21.599999999998701,"21:36:00"]
[null,"10:49:00",10.82,21.633333333332061,"21:38:00"]
[null,"10:50:00",10.83,21.666666666665378,"21:40:00"]
[null,"10:51:00",10.85,21.699999999998688,"21:42:00"]
[null,"10:52:00",10.87,21.733333333332048,"21:44:00"]
[null,"10:53:00",10.88,21.766666666665362,"21:46:00"]
[null,"10:54:00",10.9,21.799999999998722,"21:48:00"]
[null,"10:55:00",10.92,21.833333333332032,"21:50:00"]
[null,"10:56:00",10.93,21.866666666665346,"21:52:00"]
[null,"10:57:00",10.95,21.899999999998705,"21:54:00"]
[null,"10:58:00",10.97,21.933333333332016,"21:56:00"]
[null,"10:59:00",10.98,21.966666666665375,"21:58:00"]
[null,"11:00:00",{"$f":"11+C29","v":11},21.999999999998689,"22:00:00"]
[null,"11:01:00",{"$f":"11+C30","v":11.02},22.033333333331999,"22:02:00"]
[null,"11:02:00",11.03,22.066666666665359,"22:04:00"]
[null,"11:03:00",11.05,22.099999999998673,"22:06:00"]
[null,"11:04:00",11.07,22.133333333332033,"22:08:00"]
[null,"11:05:00",11.08,22.166666666665343,"22:10:00"]
[null,"11:06:00",11.1,22.199999999998656,"22:12:00"]
[null,"11:07:00",11.12,22.233333333332016,"22:14:00"]
[null,"11:08:00",11.13,22.266666666665326,"22:16:00"]
[null,"11:09:00",11.15,22.299999999998686,"22:18:00"]
[null,"11:10:00",11.17,22.333333333332,"22:20:00"]
[null,"11:11:00",11.18,22.36666666666531,"22:22:00"]
[null,"11:12:00",11.2,22.39999999999867,"22:24:00"]
[null,"11:13:00",11.22,22.433333333331987,"22:26:00"]
[null,"11:14:00",11.23,22.466666666665347,"22:28:00"]
[null,"11:15:00",11.25,22.499999999998657,"22:30:00"]
[null,"11:16:00",11.27,22.533333333331967,"22:32:00"]
[null,"11:17:00",11.28,22.566666666665327,"22:34:00"]
[null,"11:18:00",11.3,22.599999999998641,"22:36:00"]
[null,"11:19:00",11.32,22.633333333332001,"22:38:00"]
[null,"11:20:00",11.33,22.666666666665314,"22:40:00"]
[null,"11:21:00",11.35,22.699999999998624,"22:42:00"]
[null,"11:22:00",11.37,22.733333333331984,"22:44:00"]
[null,"11:23:00",11.38,22.766666666665294,"22:46:00"]
[null,"11:24:00",11.4,22.799999999998654,"22:48:00"]
[null,"11:25:00",11.42,22.833333333331968,"22:50:00"]
[null,"11:26:00",11.43,22.866666666665282,"22:52:00"]
[null,"11:27:00",11.45,22.899999999998641,"22:54:00"]
[null,"11:28:00",11.47,22.933333333331952,"22:56:00"]
[null,"11:29:00",11.48,22.966666666665311,"22:58:00"]
[null,"11:30:00",11.5,22.999999999998622,"23:00:00"]
[null,"11:31:00",11.52,23.033333333331935,"23:02:00"]
[null,"11:32:00",11.53,23.066666666665295,"23:04:00"]
[null,"11:33:00",11.55,23.099999999998609,"23:06:00"]
[null,"11:34:00",11.57,23.133333333331969,"23:08:00"]
[null,"11:35:00",11.58,23.166666666665279,"23:10:00"]
[null,"11:36:00",11.6,23.199999999998592,"23:12:00"]
[null,"11:37:00",11.62,23.233333333331952,"23:14:00"]
[null,"11:38:00",11.63,23.266666666665266,"23:16:00"]
[null,"11:39:00",11.65,23.299999999998626,"23:18:00"]
[null,"11:40:00",11.67,23.333333333331936,"23:20:00"]
[null,"11:41:00",11.68,23.36666666666525,"23:22:00"]
[null,"11:42:00",11.7,23.399999999998609,{"$f":"B731*2","v":"23:24:00"}]
[null,"11:43:00",11.72,23.43333333333192,"23:26:00"]
[null,"11:44:00",11.73,{"$f":"E733*24","v":23.466666666665279},"23:28:00"]
[null,"11:45:00",11.75,23.499999999998593,"23:30:00"]
[null,"11:46:00",11.77,23.533333333331903,"23:32:00"]
[null,"11:47:00",11.78,23.566666666665263,"23:34:00"]
[null,"11:48:00",11.8,23.599999999998577,"23:36:00"]
[null,"11:49:00",11.82,23.633333333331937,"23:38:00"]
[null,"11:50:00",11.83,23.666666666665247,"23:40:00"]
[null,"11:51:00",11.85,23.69999999999856,"23:42:00"]
[null,"11:52:00",11.87,23.73333333333192,"23:44:00"]
[null,"11:53:00",11.88,23.76666666666523,"23:46:00"]
[null,"11:54:00",11.9,23.79999999999859,"23:48:00"]
[null,"11:55:00",11.92,23.833333333331904,"23:50:00"]
[null,"11:56:00",11.93,23.866666666665214,"23:52:00"]
[null,"11:57:00",11.95,23.899999999998574,"23:54:00"]
[null,"11:58:00",11.97,23.933333333331888,"23:56:00"]
[null,"11:59:00",11.98,23.966666666665247,"23:58:00"]
[null,"12:00:00",{"$f":"12+C29","v":12},23.999999999998561,0.99999999999994005]
[null,"12:01:00",{"$f":"12+C30","v":12.02},24.033333333331875,1.001388888888828]
[null,"12:02:00",12.03,24.066666666665235,1.002777777777718]
[null,"12:03:00",12.05,24.099999999998545,1.004166666666606]
[null,"12:04:00",12.07,24.133333333331905,1.005555555555496]
[null,"12:05:00",12.08,24.166666666665215,1.006944444444384]
[null,"12:06:00",12.1,24.199999999998528,1.008333333333272]
[null,"12:07:00",12.12,24.233333333331888,1.009722222222162]
[null,"12:08:00",12.13,24.266666666665202,1.01111111111105]
[null,"12:09:00",12.15,24.299999999998562,1.01249999999994]
[null,"12:10:00",12.17,24.333333333331872,1.013888888888828]
[null,"12:11:00",12.18,24.366666666665182,1.015277777777716]
[null,"12:12:00",12.2,24.399999999998542,1.016666666666606]
[null,"12:13:00",12.22,24.433333333331856,1.018055555555494]
[null,"12:14:00",12.23,24.466666666665216,1.019444444444384]
[null,"12:15:00",12.25,24.499999999998529,1.020833333333272]
[null,"12:16:00",12.27,24.533333333331839,1.02222222222216]
[null,"12:17:00",12.28,24.566666666665199,1.02361111111105]
[null,"12:18:00",12.3,24.599999999998509,1.024999999999938]
[null,"12:19:00",12.32,24.633333333331869,1.026388888888828]
[null,"12:20:00",12.33,24.666666666665183,1.027777777777716]
[null,"12:21:00",12.35,24.699999999998496,1.0291666666666039]
[null,"12:22:00",12.37,24.733333333331856,1.0305555555554939]
[null,"12:23:00",12.38,24.766666666665166,1.0319444444443819]
[null,"12:24:00",12.4,24.799999999998526,1.0333333333332719]
[null,"12:25:00",12.42,24.833333333331836,1.0347222222221599]
[null,"12:26:00",12.43,24.86666666666515,1.0361111111110479]
[null,"12:27:00",12.45,24.89999999999851,1.0374999999999379]
[null,"12:28:00",12.47,24.933333333331824,1.0388888888888259]
[null,"12:29:00",12.48,24.966666666665184,1.0402777777777159]
[null,"12:30:00",12.5,24.999999999998494,1.0416666666666039]
[null,"12:31:00",12.52,25.033333333331804,1.0430555555554919]
[null,"12:32:00",12.53,25.066666666665164,1.0444444444443819]
[null,"12:33:00",12.55,25.099999999998481,1.0458333333332701]
[null,"12:34:00",12.57,25.133333333331841,1.0472222222221601]
[null,"12:35:00",12.58,25.166666666665154,1.0486111111110481]
[null,"12:36:00",12.6,25.199999999998468,1.0499999999999361]
[null,"12:37:00",12.62,25.233333333331828,1.0513888888888261]
[null,"12:38:00",12.63,25.266666666665138,1.0527777777777141]
[null,"12:39:00",12.65,25.299999999998498,1.0541666666666041]
[null,"12:40:00",12.67,25.333333333331808,1.0555555555554921]
[null,"12:41:00",12.68,25.366666666665122,1.0569444444443801]
[null,"12:42:00",12.7,25.399999999998482,1.0583333333332701]
[null,"12:43:00",12.72,25.433333333331795,1.0597222222221581]
[null,"12:44:00",12.73,25.466666666665155,1.0611111111110481]
[null,"12:45:00",12.75,25.499999999998465,1.0624999999999361]
[null,"12:46:00",12.77,25.533333333331775,{"$f":"B795*2","v":1.063888888888824}]
[null,"12:47:00",12.78,25.566666666665135,1.065277777777714]
[null,"12:48:00",12.8,{"$f":"E797*24","v":25.599999999998449},1.066666666666602]
[null,"12:49:00",12.82,25.633333333331809,1.068055555555492]
[null,"12:50:00",12.83,25.666666666665122,1.06944444444438]
[null,"12:51:00",12.85,25.699999999998433,1.070833333333268]
[null,"12:52:00",12.87,25.733333333331792,1.072222222222158]
[null,"12:53:00",12.88,25.766666666665103,1.073611111111046]
[null,"12:54:00",12.9,25.799999999998462,1.074999999999936]
[null,"12:55:00",12.92,25.833333333331776,1.076388888888824]
[null,"12:56:00",12.93,25.86666666666509,1.077777777777712]
[null,"12:57:00",12.95,25.89999999999845,1.079166666666602]
[null,"12:58:00",12.97,25.93333333333176,1.08055555555549]
[null,"12:59:00",12.98,25.96666666666512,1.08194444444438]
[null,"13:00:00",{"$f":"13+C29","v":13},25.99999999999843,1.083333333333268]
[null,"13:01:00",{"$f":"13+C30","v":13.02},26.033333333331743,1.084722222222156]
[null,"13:02:00",13.03,26.066666666665103,1.086111111111046]
[null,"13:03:00",13.05,26.099999999998417,1.087499999999934]
[null,"13:04:00",13.07,26.133333333331777,1.088888888888824]
[null,"13:05:00",13.08,26.166666666665087,1.090277777777712]
[null,"13:06:00",13.1,26.199999999998397,1.0916666666665999]
[null,"13:07:00",13.12,26.233333333331757,1.0930555555554899]
[null,"13:08:00",13.13,26.266666666665071,1.0944444444443779]
[null,"13:09:00",13.15,26.29999999999843,1.0958333333332679]
[null,"13:10:00",13.17,26.333333333331744,1.0972222222221559]
[null,"13:11:00",13.18,26.366666666665054,1.0986111111110439]
[null,"13:12:00",13.2,26.399999999998414,1.0999999999999339]
[null,"13:13:00",13.22,26.433333333331724,1.1013888888888219]
[null,"13:14:00",13.23,26.466666666665084,1.1027777777777119]
[null,"13:15:00",13.25,26.499999999998398,1.1041666666665999]
[null,"13:16:00",13.27,26.533333333331758,1.1055555555554899]
[null,"13:17:00",13.28,26.566666666665071,1.1069444444443779]
[null,"13:18:00",13.3,26.599999999998381,1.1083333333332659]
[null,"13:19:00",13.32,26.633333333331748,1.1097222222221561]
[null,"13:20:00",13.33,26.666666666665058,1.1111111111110441]
[null,"13:21:00",13.35,26.699999999998418,1.1124999999999341]
[null,"13:22:00",13.37,26.733333333331728,1.1138888888888221]
[null,"13:23:00",13.38,26.766666666665042,1.1152777777777101]
[null,"13:24:00",13.4,26.799999999998402,1.1166666666666001]
[null,"13:25:00",13.42,26.833333333331716,1.1180555555554881]
[null,"13:26:00",13.43,26.866666666665026,1.1194444444443761]
[null,"13:27:00",13.45,26.899999999998386,1.1208333333332661]
[null,"13:28:00",13.47,26.933333333331696,1.1222222222221541]
[null,"13:29:00",13.48,26.966666666665056,1.1236111111110441]
[null,"13:30:00",13.5,26.999999999998369,1.1249999999999321]
[null,"13:31:00",13.52,27.033333333331683,1.1263888888888201]
[null,"13:32:00",13.53,27.066666666665043,1.12777777777771]
[null,"13:33:00",13.55,27.099999999998353,1.129166666666598]
[null,"13:34:00",13.57,27.133333333331713,1.130555555555488]
[null,"13:35:00",13.58,27.166666666665023,1.131944444444376]
[null,"13:36:00",13.6,27.199999999998337,1.133333333333264]
[null,"13:37:00",13.62,27.233333333331696,1.134722222222154]
[null,"13:38:00",13.63,27.26666666666501,1.136111111111042]
[null,"13:39:00",13.65,27.29999999999837,1.137499999999932]
[null,"13:40:00",13.67,27.33333333333168,1.13888888888882]
[null,"13:41:00",13.68,27.36666666666499,1.140277777777708]
[null,"13:42:00",13.7,27.39999999999835,1.141666666666598]
[null,"13:43:00",13.72,27.433333333331664,1.143055555555486]
[null,"13:44:00",13.73,27.466666666665024,1.144444444444376]
[null,"13:45:00",13.75,27.499999999998337,1.145833333333264]
[null,"13:46:00",13.77,27.533333333331647,1.147222222222152]
[null,"13:47:00",13.78,27.566666666665007,1.148611111111042]
[null,"13:48:00",13.8,27.599999999998317,1.14999999999993]
[null,"13:49:00",13.82,27.633333333331677,1.15138888888882]
[null,"13:50:00",13.83,27.666666666664991,{"$f":"B859*2","v":1.152777777777708}]
[null,"13:51:00",13.85,27.699999999998305,1.154166666666596]
[null,"13:52:00",13.87,{"$f":"E861*24","v":27.733333333331665},1.1555555555554859]
[null,"13:53:00",13.88,27.766666666664975,1.1569444444443739]
[null,"13:54:00",13.9,27.799999999998334,1.1583333333332639]
[null,"13:55:00",13.92,27.833333333331645,1.1597222222221519]
[null,"13:56:00",13.93,27.866666666664958,1.1611111111110399]
[null,"13:57:00",13.95,27.899999999998318,1.1624999999999299]
[null,"13:58:00",13.97,27.933333333331632,1.1638888888888179]
[null,"13:59:00",13.98,27.966666666664992,1.1652777777777079]
[null,"14:00:00",{"$f":"14+C29","v":14},27.999999999998302,1.1666666666665959]
[null,"14:01:00",{"$f":"14+C30","v":14.02},28.033333333331662,1.1680555555554859]
[null,"14:02:00",14.03,28.066666666664972,1.1694444444443739]
[null,"14:03:00",14.05,28.099999999998285,1.1708333333332619]
[null,"14:04:00",14.07,28.133333333331649,1.1722222222221521]
[null,"14:05:00",14.08,28.166666666664963,1.1736111111110401]
[null,"14:06:00",14.1,28.199999999998322,1.1749999999999301]
[null,"14:07:00",14.12,28.233333333331636,1.1763888888888181]
[null,"14:08:00",14.13,28.266666666664946,1.1777777777777061]
[null,"14:09:00",14.15,28.299999999998306,1.1791666666665961]
[null,"14:10:00",14.17,28.333333333331616,1.1805555555554841]
[null,"14:11:00",14.18,28.36666666666493,1.1819444444443721]
[null,"14:12:00",14.2,28.39999999999829,1.1833333333332621]
[null,"14:13:00",14.22,28.433333333331603,1.1847222222221501]
[null,"14:14:00",14.23,28.466666666664963,1.1861111111110401]
[null,"14:15:00",14.25,28.499999999998273,1.1874999999999281]
[null,"14:16:00",14.27,28.533333333331584,1.1888888888888161]
[null,"14:17:00",14.28,28.566666666664943,1.190277777777706]
[null,"14:18:00",14.3,28.599999999998257,1.191666666666594]
[null,"14:19:00",14.32,28.633333333331617,1.193055555555484]
[null,"14:20:00",14.33,28.666666666664931,1.194444444444372]
[null,"14:21:00",14.35,28.699999999998241,1.19583333333326]
[null,"14:22:00",14.37,28.733333333331601,1.19722222222215]
[null,"14:23:00",14.38,28.766666666664911,1.198611111111038]
[null,"14:24:00",14.4,28.799999999998271,1.199999999999928]
[null,"14:25:00",14.42,28.833333333331584,1.201388888888816]
[null,"14:26:00",14.43,28.866666666664898,1.202777777777704]
[null,"14:27:00",14.45,28.899999999998258,1.204166666666594]
[null,"14:28:00",14.47,28.933333333331568,1.205555555555482]
[null,"14:29:00",14.48,28.966666666664928,1.206944444444372]
[null,"14:30:00",14.5,28.999999999998238,1.20833333333326]
[null,"14:31:00",14.52,29.033333333331552,1.209722222222148]
[null,"14:32:00",14.53,29.066666666664911,1.211111111111038]
[null,"14:33:00",14.55,29.099999999998225,1.212499999999926]
[null,"14:34:00",14.57,29.133333333331585,1.213888888888816]
[null,"14:35:00",14.58,29.166666666664895,1.215277777777704]
[null,"14:36:00",14.6,29.199999999998255,1.216666666666594]
[null,"14:37:00",14.62,29.233333333331565,1.218055555555482]
[null,"14:38:00",14.63,29.266666666664879,1.2194444444443699]
[null,"14:39:00",14.65,29.299999999998239,1.2208333333332599]
[null,"14:40:00",14.67,29.333333333331552,1.2222222222221479]
[null,"14:41:00",14.68,29.366666666664912,1.2236111111110379]
[null,"14:42:00",14.7,29.399999999998222,1.2249999999999259]
[null,"14:43:00",14.72,29.433333333331532,1.2263888888888139]
[null,"14:44:00",14.73,29.466666666664892,1.2277777777777039]
[null,"14:45:00",14.75,29.499999999998206,1.2291666666665919]
[null,"14:46:00",14.77,29.533333333331566,1.2305555555554819]
[null,"14:47:00",14.78,29.566666666664879,1.2319444444443699]
[null,"14:48:00",14.8,29.59999999999819,1.2333333333332579]
[null,"14:49:00",14.82,29.633333333331549,1.2347222222221479]
[null,"14:50:00",14.83,29.666666666664867,1.2361111111110361]
[null,"14:51:00",14.85,29.699999999998226,1.2374999999999261]
[null,"14:52:00",14.87,29.733333333331537,1.2388888888888141]
[null,"14:53:00",14.88,29.76666666666485,1.2402777777777021]
[null,"14:54:00",14.9,29.79999999999821,{"$f":"B923*2","v":1.2416666666665921}]
[null,"14:55:00",14.92,29.833333333331524,1.2430555555554801]
[null,"14:56:00",14.93,{"$f":"E925*24","v":29.866666666664834},1.2444444444443681]
[null,"14:57:00",14.95,29.899999999998194,1.2458333333332581]
[null,"14:58:00",14.97,29.933333333331504,1.2472222222221461]
[null,"14:59:00",14.98,29.966666666664864,1.2486111111110361]
[null,"15:00:00",{"$f":"15+C29","v":15},29.999999999998177,1.2499999999999241]
[null,"15:01:00",{"$f":"15+C30","v":15.02},30.033333333331491,1.2513888888888121]
[null,"15:02:00",15.03,30.066666666664851,1.2527777777777021]
[null,"15:03:00",15.05,30.099999999998161,1.25416666666659]
[null,"15:04:00",15.07,30.133333333331521,1.25555555555548]
[null,"15:05:00",15.08,30.166666666664831,1.256944444444368]
[null,"15:06:00",15.1,30.199999999998145,1.258333333333256]
[null,"15:07:00",15.12,30.233333333331505,1.259722222222146]
[null,"15:08:00",15.13,30.266666666664818,1.261111111111034]
[null,"15:09:00",15.15,30.299999999998178,1.262499999999924]
[null,"15:10:00",15.17,30.333333333331488,1.263888888888812]
[null,"15:11:00",15.18,30.366666666664798,1.2652777777777]
[null,"15:12:00",15.2,30.399999999998158,1.26666666666659]
[null,"15:13:00",15.22,30.433333333331472,1.268055555555478]
[null,"15:14:00",15.23,30.466666666664832,1.269444444444368]
[null,"15:15:00",15.25,30.499999999998145,1.270833333333256]
[null,"15:16:00",15.27,30.533333333331456,1.272222222222144]
[null,"15:17:00",15.28,30.566666666664815,1.273611111111034]
[null,"15:18:00",15.3,30.599999999998126,1.274999999999922]
[null,"15:19:00",15.32,30.633333333331485,1.276388888888812]
[null,"15:20:00",15.33,30.666666666664799,1.2777777777777]
[null,"15:21:00",15.35,30.699999999998159,1.27916666666659]
[null,"15:22:00",15.37,30.733333333331473,1.280555555555478]
[null,"15:23:00",15.38,30.766666666664783,1.2819444444443659]
[null,"15:24:00",15.4,30.799999999998143,1.2833333333332559]
[null,"15:25:00",15.42,30.833333333331453,1.2847222222221439]
[null,"15:26:00",15.43,30.866666666664813,1.2861111111110339]
[null,"15:27:00",15.45,30.899999999998126,1.2874999999999219]
[null,"15:28:00",15.47,30.93333333333144,1.2888888888888099]
[null,"15:29:00",15.48,30.9666666666648,1.2902777777776999]
[null,"15:30:00",15.5,30.99999999999811,1.2916666666665879]
[null,"15:31:00",15.52,31.03333333333147,1.2930555555554779]
[null,"15:32:00",15.53,31.06666666666478,1.2944444444443659]
[null,"15:33:00",15.55,31.099999999998094,1.2958333333332539]
[null,"15:34:00",15.57,31.133333333331453,1.2972222222221439]
[null,"15:35:00",15.58,31.166666666664767,1.2986111111110319]
[null,"15:36:00",15.6,31.199999999998131,1.2999999999999221]
[null,"15:37:00",15.62,31.233333333331444,1.3013888888888101]
[null,"15:38:00",15.63,31.266666666664754,1.3027777777776981]
[null,"15:39:00",15.65,31.299999999998114,1.3041666666665881]
[null,"15:40:00",15.67,31.333333333331424,1.3055555555554761]
[null,"15:41:00",15.68,31.366666666664738,1.3069444444443641]
[null,"15:42:00",15.7,31.399999999998098,1.3083333333332541]
[null,"15:43:00",15.72,31.433333333331412,1.3097222222221421]
[null,"15:44:00",15.73,31.466666666664771,1.3111111111110321]
[null,"15:45:00",15.75,31.499999999998082,1.3124999999999201]
[null,"15:46:00",15.77,31.533333333331392,1.3138888888888081]
[null,"15:47:00",15.78,31.566666666664752,1.3152777777776981]
[null,"15:48:00",15.8,31.599999999998065,1.316666666666586]
[null,"15:49:00",15.82,31.633333333331425,1.318055555555476]
[null,"15:50:00",15.83,31.666666666664739,1.319444444444364]
[null,"15:51:00",15.85,31.699999999998049,1.320833333333252]
[null,"15:52:00",15.87,31.733333333331409,1.322222222222142]
[null,"15:53:00",15.88,31.766666666664719,1.32361111111103]
[null,"15:54:00",15.9,31.799999999998079,1.32499999999992]
[null,"15:55:00",15.92,31.833333333331392,1.326388888888808]
[null,"15:56:00",15.93,31.866666666664752,1.327777777777698]
[null,"15:57:00",15.95,31.899999999998066,1.329166666666586]
[null,"15:58:00",15.97,31.933333333331376,{"$f":"B987*2","v":1.330555555555474}]
[null,"15:59:00",15.98,31.966666666664736,1.331944444444364]
[null,"16:00:00",{"$f":"16+C29","v":16},{"$f":"E989*24","v":31.999999999998046},1.333333333333252]
[null,"16:01:00",{"$f":"16+C30","v":16.02},32.033333333331406,1.334722222222142]
[null,"16:02:00",16.03,32.066666666664716,1.33611111111103]
[null,"16:03:00",16.05,32.099999999998033,1.337499999999918]
[null,"16:04:00",16.07,32.133333333331393,1.338888888888808]
[null,"16:05:00",16.079999999999998,32.166666666664703,1.340277777777696]
[null,"16:06:00",16.100000000000001,32.199999999998063,1.341666666666586]
[null,"16:07:00",16.12,32.233333333331373,1.343055555555474]
[null,"16:08:00",16.13,32.26666666666469,1.344444444444362]
[null,"16:09:00",16.149999999999999,32.29999999999805,1.3458333333332519]
[null,"16:10:00",16.170000000000002,32.33333333333136,1.3472222222221399]
[null,"16:11:00",16.18,32.36666666666472,1.3486111111110299]
[null,"16:12:00",16.2,32.39999999999803,1.3499999999999179]
[null,"16:13:00",16.22,32.43333333333134,1.3513888888888059]
[null,"16:14:00",16.23,32.4666666666647,1.3527777777776959]
[null,"16:15:00",16.25,32.49999999999801,1.3541666666665839]
[null,"16:16:00",16.27,32.53333333333137,1.3555555555554739]
[null,"16:17:00",16.28,32.566666666664688,1.3569444444443619]
[null,"16:18:00",16.3,32.599999999997998,1.3583333333332499]
[null,"16:19:00",16.32,32.633333333331358,1.3597222222221399]
[null,"16:20:00",16.329999999999998,32.666666666664668,1.3611111111110279]
[null,"16:21:00",16.350000000000001,32.699999999998035,1.3624999999999181]
[null,"16:22:00",16.37,32.733333333331345,1.3638888888888061]
[null,"16:23:00",16.38,32.766666666664662,1.3652777777776941]
[null,"16:24:00",16.399999999999999,32.799999999998022,1.3666666666665841]
[null,"16:25:00",16.420000000000002,32.833333333331332,1.3680555555554721]
[null,"16:26:00",16.43,32.866666666664642,1.3694444444443601]
[null,"16:27:00",16.45,32.899999999998002,1.3708333333332501]
[null,"16:28:00",16.47,32.933333333331312,1.3722222222221381]
[null,"16:29:00",16.48,32.966666666664672,1.3736111111110281]
[null,"16:30:00",16.5,32.999999999997982,1.3749999999999161]
[null,"16:31:00",16.52,33.033333333331299,1.3763888888888041]
[null,"16:32:00",16.53,33.066666666664659,1.3777777777776941]
[null,"16:33:00",16.55,33.099999999997969,1.3791666666665821]
[null,"16:34:00",16.57,33.133333333331329,1.380555555555472]
[null,"16:35:00",16.579999999999998,33.166666666664639,1.38194444444436]
[null,"16:36:00",16.600000000000001,33.199999999997956,1.383333333333248]
[null,"16:37:00",16.62,33.233333333331316,1.384722222222138]
[null,"16:38:00",16.63,33.266666666664626,1.386111111111026]
[null,"16:39:00",16.649999999999999,33.299999999997986,1.387499999999916]
[null,"16:40:00",16.670000000000002,33.333333333331296,1.388888888888804]
[null,"16:41:00",16.68,33.366666666664656,1.390277777777694]
[null,"16:42:00",16.7,33.399999999997966,1.391666666666582]
[null,"16:43:00",16.72,33.433333333331277,1.39305555555547]
[null,"16:44:00",16.73,33.466666666664636,1.39444444444436]
[null,"16:45:00",16.75,33.499999999997954,1.395833333333248]
[null,"16:46:00",16.77,33.533333333331313,1.397222222222138]
[null,"16:47:00",16.78,33.566666666664624,1.398611111111026]
[null,"16:48:00",16.8,33.599999999997934,1.399999999999914]
[null,"16:49:00",16.82,33.633333333331294,1.401388888888804]
[null,"16:50:00",16.829999999999998,33.666666666664611,1.402777777777692]
[null,"16:51:00",16.850000000000001,33.699999999997971,1.404166666666582]
[null,"16:52:00",16.87,33.733333333331281,1.40555555555547]
[null,"16:53:00",16.88,33.766666666664591,1.406944444444358]
[null,"16:54:00",16.899999999999999,33.799999999997951,1.4083333333332479]
[null,"16:55:00",16.920000000000002,33.833333333331261,1.4097222222221359]
[null,"16:56:00",16.93,33.866666666664621,1.4111111111110259]
[null,"16:57:00",16.95,33.899999999997931,1.4124999999999139]
[null,"16:58:00",16.97,33.933333333331248,1.4138888888888019]
[null,"16:59:00",16.98,33.966666666664608,1.4152777777776919]
[null,"17:00:00",{"$f":"17+C29","v":17},33.999999999997918,1.4166666666665799]
[null,"17:01:00",{"$f":"17+C30","v":17.02},34.033333333331278,1.4180555555554699]
[null,"17:02:00",17.03,34.066666666664588,{"$f":"B1051*2","v":1.4194444444443579}]
[null,"17:03:00",17.05,34.099999999997905,1.4208333333332459]
[null,"17:04:00",17.07,{"$f":"E1053*24","v":34.133333333331265},1.4222222222221359]
[null,"17:05:00",17.079999999999998,34.166666666664575,1.4236111111110239]
[null,"17:06:00",17.100000000000001,34.199999999997935,1.4249999999999139]
[null,"17:07:00",17.12,34.233333333331252,1.4263888888888021]
[null,"17:08:00",17.13,34.266666666664563,1.4277777777776901]
[null,"17:09:00",17.149999999999999,34.299999999997922,1.4291666666665801]
[null,"17:10:00",17.170000000000002,34.333333333331232,1.4305555555554681]
[null,"17:11:00",17.18,34.366666666664543,1.4319444444443561]
[null,"17:12:00",17.2,34.399999999997902,1.4333333333332461]
[null,"17:13:00",17.22,34.43333333333122,1.4347222222221341]
[null,"17:14:00",17.23,34.46666666666458,1.4361111111110241]
[null,"17:15:00",17.25,34.49999999999789,1.4374999999999121]
[null,"17:16:00",17.27,34.53333333333125,1.4388888888888021]
[null,"17:17:00",17.28,34.56666666666456,1.4402777777776901]
[null,"17:18:00",17.3,34.599999999997877,1.4416666666665781]
[null,"17:19:00",17.32,34.633333333331237,1.4430555555554681]
[null,"17:20:00",17.329999999999998,34.666666666664547,1.444444444444356]
[null,"17:21:00",17.350000000000001,34.699999999997907,1.445833333333246]
[null,"17:22:00",17.37,34.733333333331217,1.447222222222134]
[null,"17:23:00",17.38,34.766666666664527,1.448611111111022]
[null,"17:24:00",17.399999999999999,34.799999999997887,1.449999999999912]
[null,"17:25:00",17.420000000000002,34.833333333331197,1.4513888888888]
[null,"17:26:00",17.43,34.866666666664557,1.45277777777769]
[null,"17:27:00",17.45,34.899999999997874,1.454166666666578]
[null,"17:28:00",17.47,34.933333333331184,1.455555555555466]
[null,"17:29:00",17.48,34.966666666664544,1.456944444444356]
[null,"17:30:00",17.5,34.999999999997854,1.458333333333244]
[null,"17:31:00",17.52,35.033333333331214,1.459722222222134]
[null,"17:32:00",17.53,35.066666666664531,1.461111111111022]
[null,"17:33:00",17.55,35.099999999997841,1.46249999999991]
[null,"17:34:00",17.57,35.133333333331201,1.4638888888888]
[null,"17:35:00",17.579999999999998,35.166666666664511,1.465277777777688]
[null,"17:36:00",17.600000000000001,35.199999999997871,1.466666666666578]
[null,"17:37:00",17.62,35.233333333331181,1.468055555555466]
[null,"17:38:00",17.63,35.266666666664491,1.469444444444354]
[null,"17:39:00",17.649999999999999,35.299999999997851,1.470833333333244]
[null,"17:40:00",17.670000000000002,35.333333333331169,1.4722222222221319]
[null,"17:41:00",17.68,35.366666666664528,1.4736111111110219]
[null,"17:42:00",17.7,35.399999999997839,1.4749999999999099]
[null,"17:43:00",17.72,35.433333333331149,1.4763888888887979]
[null,"17:44:00",17.73,35.466666666664509,1.4777777777776879]
[null,"17:45:00",17.75,35.499999999997826,1.4791666666665759]
[null,"17:46:00",17.77,35.533333333331186,1.4805555555554659]
[null,"17:47:00",17.78,35.566666666664496,1.4819444444443539]
[null,"17:48:00",17.8,35.599999999997806,1.4833333333332419]
[null,"17:49:00",17.82,35.633333333331166,1.4847222222221319]
[null,"17:50:00",17.829999999999998,35.666666666664476,1.4861111111110199]
[null,"17:51:00",17.850000000000001,35.699999999997836,1.4874999999999099]
[null,"17:52:00",17.87,35.733333333331146,1.4888888888887979]
[null,"17:53:00",17.88,35.766666666664463,1.4902777777776861]
[null,"17:54:00",17.899999999999999,35.799999999997823,1.4916666666665761]
[null,"17:55:00",17.920000000000002,35.83333333333114,1.4930555555554641]
[null,"17:56:00",17.93,35.86666666666445,1.4944444444443521]
[null,"17:57:00",17.95,35.89999999999781,1.4958333333332421]
[null,"17:58:00",17.97,35.93333333333112,1.4972222222221301]
[null,"17:59:00",17.98,35.96666666666448,1.4986111111110201]
[null,"18:00:00",{"$f":"18+C29","v":18},35.999999999997797,1.4999999999999081]
[null,"18:01:00",{"$f":"18+C30","v":18.02},36.033333333331157,1.5013888888887981]
[null,"18:02:00",18.03,36.066666666664467,1.5027777777776861]
[null,"18:03:00",18.05,36.099999999997777,1.5041666666665741]
[null,"18:04:00",18.07,36.133333333331137,1.5055555555554641]
[null,"18:05:00",18.079999999999998,36.166666666664447,1.506944444444352]
[null,"18:06:00",18.100000000000001,36.199999999997807,{"$f":"B1115*2","v":1.508333333333242}]
[null,"18:07:00",18.12,36.233333333331117,1.50972222222213]
[null,"18:08:00",18.13,{"$f":"E1117*24","v":36.266666666664435},1.511111111111018]
[null,"18:09:00",18.149999999999999,36.299999999997794,1.512499999999908]
[null,"18:10:00",18.170000000000002,36.333333333331105,1.513888888888796]
[null,"18:11:00",18.18,36.366666666664464,1.515277777777686]
[null,"18:12:00",18.2,36.399999999997775,1.516666666666574]
[null,"18:13:00",18.22,36.433333333331092,1.518055555555462]
[null,"18:14:00",18.23,36.466666666664452,1.519444444444352]
[null,"18:15:00",18.25,36.499999999997762,1.52083333333324]
[null,"18:16:00",18.27,36.533333333331122,1.52222222222213]
[null,"18:17:00",18.28,36.566666666664432,1.523611111111018]
[null,"18:18:00",18.3,36.599999999997742,1.524999999999906]
[null,"18:19:00",18.32,36.633333333331102,1.526388888888796]
[null,"18:20:00",18.329999999999998,36.666666666664412,1.527777777777684]
[null,"18:21:00",18.350000000000001,36.699999999997772,1.529166666666574]
[null,"18:22:00",18.37,36.733333333331089,1.530555555555462]
[null,"18:23:00",18.38,36.766666666664399,1.53194444444435]
[null,"18:24:00",18.399999999999999,36.799999999997759,1.53333333333324]
[null,"18:25:00",18.420000000000002,36.833333333331069,1.534722222222128]
[null,"18:26:00",18.43,36.866666666664429,1.5361111111110179]
[null,"18:27:00",18.45,36.899999999997746,1.5374999999999059]
[null,"18:28:00",18.47,36.933333333331056,1.5388888888887939]
[null,"18:29:00",18.48,36.966666666664416,1.5402777777776839]
[null,"18:30:00",18.5,36.999999999997726,1.5416666666665719]
[null,"18:31:00",18.52,37.033333333331086,1.5430555555554619]
[null,"18:32:00",18.53,37.066666666664396,1.5444444444443499]
[null,"18:33:00",18.55,37.099999999997706,1.5458333333332379]
[null,"18:34:00",18.57,37.133333333331066,1.5472222222221279]
[null,"18:35:00",18.579999999999998,37.166666666664383,1.5486111111110159]
[null,"18:36:00",18.600000000000001,37.199999999997743,1.5499999999999059]
[null,"18:37:00",18.62,37.233333333331053,1.5513888888887939]
[null,"18:38:00",18.63,37.266666666664364,1.5527777777776819]
[null,"18:39:00",18.649999999999999,37.299999999997731,1.5541666666665721]
[null,"18:40:00",18.670000000000002,37.333333333331041,1.5555555555554601]
[null,"18:41:00",18.68,37.366666666664401,1.5569444444443501]
[null,"18:42:00",18.7,37.399999999997718,1.5583333333332381]
[null,"18:43:00",18.72,37.433333333331028,1.5597222222221261]
[null,"18:44:00",18.73,37.466666666664388,1.5611111111110161]
[null,"18:45:00",18.75,37.499999999997698,1.5624999999999041]
[null,"18:46:00",18.77,37.533333333331058,1.5638888888887941]
[null,"18:47:00",18.78,37.566666666664368,1.5652777777776821]
[null,"18:48:00",18.8,37.599999999997678,1.5666666666665701]
[null,"18:49:00",18.82,37.633333333331038,1.5680555555554601]
[null,"18:50:00",18.829999999999998,37.666666666664355,1.5694444444443481]
[null,"18:51:00",18.850000000000001,37.699999999997715,1.570833333333238]
[null,"18:52:00",18.87,37.733333333331025,1.572222222222126]
[null,"18:53:00",18.88,37.766666666664335,1.573611111111014]
[null,"18:54:00",18.899999999999999,37.799999999997695,1.574999999999904]
[null,"18:55:00",18.920000000000002,37.833333333331012,1.576388888888792]
[null,"18:56:00",18.93,37.866666666664372,1.577777777777682]
[null,"18:57:00",18.95,37.899999999997682,1.57916666666657]
[null,"18:58:00",18.97,37.933333333330992,1.580555555555458]
[null,"18:59:00",18.98,37.966666666664352,1.581944444444348]

{"sheet":"Hébergement","index":10,"n_rows":31,"n_cols":6,"rows_kept":31,"cut":false,"hidden":true,"merged":[[8,1,8,5],[31,1,34,5]]}
[]
[]
[null,null,null,null,null,{"$f":"Général!L3","v":0}]
[]
[]
[]
[]
[]
[null,{"$f":"IF(OR(Général!J65=2,'Calculs choix indemnité'!A10<'Calculs choix indemnité'!A12),\n\"ATTENTION: Vous ne pouvez demander le remboursement des frais d'hébergement.\",\n\"\")","v":{"$error":"#VALUE!"}}]
[]
[null,"Remplir les cellules jaunes seulement, si votre transport comprend un coucher."]
[]
[]
[null,null,null,{"$f":"CONCATENATE(Général!G9,\" \",Général!J9)","v":" "},null,{"$f":"CONCATENATE(Général!G10,\" \",Général!J10)","v":" "}]
[]
[]
[null,"Lieu du coucher",null,null,null,{"$f":"D17","v":0}]
[]
[null,"Période le l'année",null,null,null,{"$f":"D19","v":0}]
[null,"Montant maximal pouvant être remboursé excluant toutes taxes",null,{"$f":"IFERROR(INDEX(Divers!$G$8:$H$16,MATCH(D17,Divers!$F$8:$F$16,0),MATCH(D19,Divers!$G$7:$H$7,0)),\"\")","v":""},null,{"$f":"IFERROR(INDEX(Divers!$G$8:$H$16,MATCH(F17,Divers!$F$8:$F$16,0),MATCH(F19,Divers!$G$7:$H$7,0)),\"\")","v":""}]
[null,"Coût du coucher inscrit sur la facture avant toutes taxes"]
[]
[null,"Taxes sur l'hébergement inscrit sur la facture"]
[]
[null,"Montant maximal pouvant être remboursé excluant TPS et TVQ",null,{"$f":"IF(D20<D21,D20+D23,D21+D23)","v":0},null,{"$f":"IF(F20<F21,F20+F23,F21+F23)","v":0}]
[]
[null,null,null,null,null,{"$f":"IFERROR(D25+F25,\"\")","v":0}]
[]
[]
[]
[null,"Commentaires:"]

{"sheet":"Repas","index":11,"n_rows":79,"n_cols":15,"rows_kept":79,"cut":false,"hidden":true,"merged":[[13,3,13,5],[16,13,16,14],[13,8,13,10],[79,1,81,12],[48,13,48,14],[46,1,46,12]]}
[]
[]
[]
[null,null,null,null,null,null,null,null,null,null,null,{"$f":"Général!L3","v":0}]
[]
[]
[]
[]
[]
[]
[null,"Remplir les cellules jaunes seulement. Inscrire le coût des repas sans taxes, et les pourboires séparément."]
[]
[]
[null,null,null,{"$f":"CONCATENATE(Général!G9,\" \",Général!J9)","v":" "},null,null,null,null,{"$f":"CONCATENATE(Général!G10,\" \",Général!J10)","v":" "}]
[]
[]
[null,"Déjeuner",null,"Coûts réels",null,"Coûts admissibles",null,null,"Coûts réels",null,"Coûts admissibles",null,"Total coûts admissibles","colonnes pour pourboire maximum admissible A CACHER"]
[null,null,null,null,null,null,null,null,null,null,null,null,null,"trudeau","simars"]
[null,"Coût avant taxes",null,null,null,{"$f":"IF($D19+$D20<'Calculs repas'!$D$12,$D19,'Calculs repas'!$D$7)","v":0},null,null,null,null,{"$f":"IF($I19+$I20<'Calculs repas'!$D$12,$I19,'Calculs repas'!$D$7)","v":0},null,{"$f":"F19+K19","v":0},{"$f":"$F19+$F20","v":0},{"$f":"$K19+$K20","v":0}]
[null,"Taxes",null,{"$f":"ROUND(D19*TAUX!$C$61,2)+ROUND(D19*TAUX!$C$62,2)","v":0},null,{"$f":"IF($D19+$D20<'Calculs repas'!$D$12,$D20,'Calculs repas'!$D$10)","v":0},null,null,{"$f":"ROUND(I19*TAUX!$C$61,2)+ROUND(I19*TAUX!$C$62,2)","v":0},null,{"$f":"IF($I19+$I20<'Calculs repas'!$D$12,$I20,'Calculs repas'!$D$10)","v":0},null,{"$f":"F20+K20","v":0},{"$f":"$D21","v":0},{"$f":"$I21","v":0}]
[null,"Pourboire",null,null,null,{"$f":"IF($N20<$N21,$N20,$N21)","v":0},null,null,null,null,{"$f":"IF($O20<$O21,$O20,$O21)","v":0},null,{"$f":"F21+K21","v":0},{"$f":"IF('Calculs repas'!$D$12-$N19>0,'Calculs repas'!$D$12-$N19,)","v":14.66},{"$f":"IF('Calculs repas'!$D$12-$O19>0,'Calculs repas'!$D$12-$O19,)","v":14.66}]
[null,"Total déjeuner",null,{"$f":"SUM(D19:D21)","v":0},null,{"$f":"SUM(F19:F21)","v":0},null,null,{"$f":"SUM(I19:I21)","v":0},null,{"$f":"SUM(K19:K21)","v":0},null,{"$f":"F22+K22","v":0}]
[]
[]
[]
[null,"Dîner",null,"Coûts réels",null,"Coûts admissibles",null,null,"Coûts réels",null,"Coûts admissibles",null,"Total coûts admissibles"]
[]
[null,"Coût avant taxes",null,null,null,{"$f":"IF($D28+$D29<'Calculs repas'!$F$12,$D28,'Calculs repas'!$F$7)","v":0},null,null,null,null,{"$f":"IF($I28+$I29<'Calculs repas'!$F$12,$I28,'Calculs repas'!$F$7)","v":0},null,{"$f":"F28+K28","v":0},{"$f":"$F28+$F29","v":0},{"$f":"$K28+$K29","v":0}]
[null,"Taxes",null,{"$f":"ROUND(D28*TAUX!$C$61,2)+ROUND(D28*TAUX!$C$62,2)","v":0},null,{"$f":"IF($D28+$D29<'Calculs repas'!$F$12,$D29,'Calculs repas'!$F$10)","v":0},null,null,{"$f":"ROUND(I28*TAUX!$C$61,2)+ROUND(I28*TAUX!$C$62,2)","v":0},null,{"$f":"IF($I28+$I29<'Calculs repas'!$F$12,$I29,'Calculs repas'!$F$10)","v":0},null,{"$f":"F29+K29","v":0},{"$f":"$D30","v":0},{"$f":"$I30","v":0}]
[null,"Pourboire",null,null,null,{"$f":"IF($N29<$N30,$N29,$N30)","v":0},null,null,null,null,{"$f":"IF($O29<$O30,$O29,$O30)","v":0},null,{"$f":"F30+K30","v":0},{"$f":"IF('Calculs repas'!$F$12-$N28>0,'Calculs repas'!$F$12-$N28,)","v":20.178112500000001},{"$f":"IF('Calculs repas'!$F$12-$O28>0,'Calculs repas'!$F$12-$O28,)","v":20.178112500000001}]
[null,"Total déjeuner",null,{"$f":"SUM(D28:D30)","v":0},null,{"$f":"SUM(F28:F30)","v":0},null,null,{"$f":"SUM(I28:I30)","v":0},null,{"$f":"SUM(K28:K30)","v":0},null,{"$f":"F31+K31","v":0}]
[]
[]
[]
[null,"Souper",null,"Coûts réels",null,"Coûts admissibles",null,null,"Coûts réels",null,"Coûts admissibles",null,"Total coûts admissibles"]
[]
[null,"Coût avant taxes",null,null,null,{"$f":"IF($D37+$D38<'Calculs repas'!$H$12,$D37,'Calculs repas'!$H$7)","v":0},null,null,null,null,{"$f":"IF($I37+$I38<'Calculs repas'!$H$12,$I37,'Calculs repas'!$H$7)","v":0},null,{"$f":"F37+K37","v":0},{"$f":"$F37+$F38","v":0},{"$f":"$K37+$K38","v":0}]
[null,"Taxes",null,{"$f":"D37*ROUNDUP(TAUX!D63,3)","v":0},null,{"$f":"IF($D37+$D38<'Calculs repas'!$H$12,\n$D38,\n'Calculs repas'!$H$10)","v":0},null,null,{"$f":"IF(I37=\"18,70 $\",[1]calculsrepas!$H$10,I37*TAUX!$C$63)","v":0},null,{"$f":"IF($I37+$I38<'Calculs repas'!$H$12,$I38,'Calculs repas'!$H$10)","v":0},null,{"$f":"F38+K38","v":0},{"$f":"$D39","v":0},{"$f":"$I39","v":0}]
[null,"Pourboire",null,null,null,{"$f":"IF($N38<$N39,$N38,$N39)","v":0},null,null,null,null,{"$f":"IF($O38<$O39,$O38,$O39)","v":0},null,{"$f":"F39+K39","v":0},{"$f":"IF('Calculs repas'!$H$12-$N37>0,'Calculs repas'!$H$12-$N37,)","v":30.47},{"$f":"IF('Calculs repas'!$H$12-$O37>0,'Calculs repas'!$H$12-$O37,)","v":30.47}]
[null,"Total déjeuner",null,{"$f":"SUM(D37:D39)","v":0},null,{"$f":"SUM(F37:F39)","v":0},null,null,{"$f":"SUM(I37:I39)","v":0},null,{"$f":"SUM(K37:K39)","v":0},null,{"$f":"F40+K40","v":0}]
[]
[null,null,null,null,null,null,null,null,null,null,"Repas (section dépenses taxables remboursables)",null,{"$f":"M19+M28+M37","v":0}]
[null,null,null,null,null,null,null,null,null,null,"Taxes",null,{"$f":"M20+M29+M38","v":0}]
[null,null,null,null,null,null,null,null,null,null,"Pourboires (section dépenses non taxables remboursables)",null,{"$f":"M21+M30+M39","v":0}]
[null,null,null,null,null,null,null,null,null,null,"Total",null,{"$f":"SUM(M42:M44)","v":0}]
[]
[null,"REPAS AU-DELÀ DES PREMIERS 24 HEURES SEULEMENT"]
[]
[null,"Déjeuner",null,"Coûts réels",null,"Coûts admissibles",null,null,"Coûts réels",null,"Coûts admissibles",null,"Total coûts admissibles","colonnes pour pourboire maximum admissible A CACHER"]
[null,null,null,null,null,null,null,null,null,null,null,null,null,"trudeau","simars"]
[null,"Coût avant taxes",null,null,null,{"$f":"IF($D51+$D52<'Calculs repas'!$D$12,$D51,'Calculs repas'!$D$7)","v":0},null,null,null,null,{"$f":"IF($I51+$I52<'Calculs repas'!$D$12,$I51,'Calculs repas'!$D$7)","v":0},null,{"$f":"F51+K51","v":0},{"$f":"$F51+$F52","v":0},{"$f":"$K51+$K52","v":0}]
[null,"Taxes",null,{"$f":"ROUND(D51*TAUX!$C$61,2)+ROUND(D51*TAUX!$C$62,2)","v":0},null,{"$f":"IF($D51+$D52<'Calculs repas'!$D$12,$D52,'Calculs repas'!$D$10)","v":0},null,null,{"$f":"ROUND(I51*TAUX!$C$61,2)+ROUND(I51*TAUX!$C$62,2)","v":0},null,{"$f":"IF($I51+$I52<'Calculs repas'!$D$12,$I52,'Calculs repas'!$D$10)","v":0},null,{"$f":"F52+K52","v":0},{"$f":"$D53","v":0},{"$f":"$I53","v":0}]
[null,"Pourboire",null,null,null,{"$f":"IF($N52<$N53,$N52,$N53)","v":0},null,null,null,null,{"$f":"IF($O52<$O53,$O52,$O53)","v":0},null,{"$f":"F53+K53","v":0},{"$f":"IF('Calculs repas'!$D$12-$N51>0,'Calculs repas'!$D$12-$N51,)","v":14.66},{"$f":"IF('Calculs repas'!$D$12-$O51>0,'Calculs repas'!$D$12-$O51,)","v":14.66}]
[null,"Total déjeuner",null,{"$f":"SUM(D51:D53)","v":0},null,{"$f":"SUM(F51:F53)","v":0},null,null,{"$f":"SUM(I51:I53)","v":0},null,{"$f":"SUM(K51:K53)","v":0},null,{"$f":"F54+K54","v":0}]
[]
[]
[]
[null,"Dîner",null,"Coûts réels",null,"Coûts admissibles",null,null,"Coûts réels",null,"Coûts admissibles",null,"Total coûts admissibles"]
[]
[null,"Coût avant taxes",null,null,null,{"$f":"IF($D60+$D61<'Calculs repas'!$F$12,$D60,'Calculs repas'!$F$7)","v":0},null,null,null,null,{"$f":"IF($I60+$I61<'Calculs repas'!$F$12,$I60,'Calculs repas'!$F$7)","v":0},null,{"$f":"F60+K60","v":0},{"$f":"$F60+$F61","v":0},{"$f":"$K60+$K61","v":0}]
[null,"Taxes",null,{"$f":"ROUND(D60*TAUX!$C$61,2)+ROUND(D60*TAUX!$C$62,2)","v":0},null,{"$f":"IF($D60+$D61<'Calculs repas'!$F$12,$D61,'Calculs repas'!$F$10)","v":0},null,null,{"$f":"ROUND(I60*TAUX!$C$61,2)+ROUND(I60*TAUX!$C$62,2)","v":0},null,{"$f":"IF($I60+$I61<'Calculs repas'!$F$12,$I61,'Calculs repas'!$F$10)","v":0},null,{"$f":"F61+K61","v":0},{"$f":"$D62","v":0},{"$f":"$I62","v":0}]
[null,"Pourboire",null,null,null,{"$f":"IF($N61<$N62,$N61,$N62)","v":0},null,null,null,null,{"$f":"IF($O61<$O62,$O61,$O62)","v":0},null,{"$f":"F62+K62","v":0},{"$f":"IF('Calculs repas'!$F$12-$N60>0,'Calculs repas'!$F$12-$N60,)","v":20.178112500000001},{"$f":"IF('Calculs repas'!$F$12-$O60>0,'Calculs repas'!$F$12-$O60,)","v":20.178112500000001}]
[null,"Total déjeuner",null,{"$f":"SUM(D60:D62)","v":0},null,{"$f":"SUM(F60:F62)","v":0},null,null,{"$f":"SUM(I60:I62)","v":0},null,{"$f":"SUM(K60:K62)","v":0},null,{"$f":"F63+K63","v":0}]
[]
[]
[]
[null,"Souper",null,"Coûts réels",null,"Coûts admissibles",null,null,"Coûts réels",null,"Coûts admissibles",null,"Total coûts admissibles"]
[]
[null,"Coût avant taxes",null,null,null,{"$f":"IF($D69+$D70<'Calculs repas'!$H$12,$D69,'Calculs repas'!$H$7)","v":0},null,null,null,null,{"$f":"IF($I69+$I70<'Calculs repas'!$H$12,$I69,'Calculs repas'!$H$7)","v":0},null,{"$f":"F69+K69","v":0},{"$f":"$F69+$F70","v":0},{"$f":"$K69+$K70","v":0}]
[null,"Taxes",null,{"$f":"D69*ROUNDUP(TAUX!D63,3)","v":0},null,{"$f":"IF($D69+$D70<'Calculs repas'!$H$12,$D70,'Calculs repas'!$H$10)","v":0},null,null,{"$f":"IF(I69=\"18,70 $\",[1]calculsrepas!$H$10,I69*TAUX!$C$63)","v":0},null,{"$f":"IF($I69+$I70<'Calculs repas'!$H$12,$I70,'Calculs repas'!$H$10)","v":0},null,{"$f":"F70+K70","v":0},{"$f":"$D71","v":0},{"$f":"$I71","v":0}]
[null,"Pourboire",null,null,null,{"$f":"IF($N70<$N71,$N70,$N71)","v":0},null,null,null,null,{"$f":"IF($O70<$O71,$O70,$O71)","v":0},null,{"$f":"F71+K71","v":0},{"$f":"IF('Calculs repas'!$H$12-$N69>0,'Calculs repas'!$H$12-$N69,)","v":30.47},{"$f":"IF('Calculs repas'!$H$12-$O69>0,'Calculs repas'!$H$12-$O69,)","v":30.47}]
[null,"Total déjeuner",null,{"$f":"SUM(D69:D71)","v":0},null,{"$f":"SUM(F69:F71)","v":0},null,null,{"$f":"SUM(I69:I71)","v":0},null,{"$f":"SUM(K69:K71)","v":0},null,{"$f":"F72+K72","v":0}]
[]
[]
[null,null,null,null,null,null,null,null,null,null,"Repas (section dépenses taxables remboursables)",null,{"$f":"M51+M60+M69","v":0}]
[null,null,null,null,null,null,null,null,null,null,"Taxes",null,{"$f":"M52+M61+M70","v":0}]
[null,null,null,null,null,null,null,null,null,null,"Pourboires (section dépenses non taxables remboursables)",null,{"$f":"M53+M62+M71","v":0}]
[null,null,null,null,null,null,null,null,null,null,"Total",null,{"$f":"SUM(M75:M77)","v":0}]
[null,"Commentaires:"]

{"sheet":"Garde","index":12,"n_rows":36,"n_cols":11,"rows_kept":36,"cut":false,"hidden":true,"merged":[[32,1,33,10],[36,1,41,10]]}
[]
[]
[]
[null,null,null,null,null,null,null,null,null,null,{"$f":"Général!L3","v":0}]
[]
[]
[]
[null,"Remplir les cellules jaunes seulement."]
[null,null,null,"Début",null,"Fin","date en texte et heure en texte","date en texte et heure en texte","Début / Fin","Durée en heures et minutes","Nombre de périodes"]
[]
[]
[null,"Date:",null,null,null,null,{"$f":"IF(D12=\"\",\"\",(TEXT(D12,\"aaaa-mm-jj\")))","v":""},{"$f":"IF(F12=\"\",\"\",TEXT(F12,\"aaaa-mm-jj\"))","v":""},{"$f":"G12&\" \"&G14","v":" "}]
[]
[null,"Heure:",null,null,null,null,{"$f":"IF(D14=\"\",\"\",TEXT(D14,\"hh:mm\"))","v":""},{"$f":"IF(G14=\"\",\"\",TEXT(F14,\"hh:mm\"))","v":""},{"$f":"H12&\" \"&H14","v":" "},{"$f":"IFERROR(IF(I14-I12>=0,I14-I12,\"\"),\"\")","v":""},{"$f":"IF(J14<=Divers!$C$7,1,IF(J14<=Divers!$C$8,2,IF(J14<=Divers!$C$9,3,IF(J14<=Divers!$C$10,4,IF(J14<=Divers!$C$11,5,IF(J14<=Divers!$C$12,6,IF(J14<=Divers!$C$13,7,IF(J14<=Divers!$C$14,8))))))))","v":false}]
[]
[]
[]
[null,"Date:",null,null,null,null,{"$f":"IF(D18=\"\",\"\",(TEXT(D18,\"aaaa-mm-jj\")))","v":""},{"$f":"IF(F18=\"\",\"\",TEXT(F18,\"aaaa-mm-jj\"))","v":""},{"$f":"G18&\" \"&G20","v":" "}]
[]
[null,"Heure:",null,null,null,null,{"$f":"IF(D20=\"\",\"\",TEXT(D20,\"hh:mm\"))","v":""},{"$f":"IF(G20=\"\",\"\",TEXT(F20,\"hh:mm\"))","v":""},{"$f":"H18&\" \"&H20","v":" "},{"$f":"IFERROR(IF(I20-I18>0,I20-I18,\"\"),\"\")","v":""},{"$f":"IF(J20<=Divers!$C$7,1,IF(J20<=Divers!$C$8,2,IF(J20<=Divers!$C$9,3,IF(J20<=Divers!$C$10,4,IF(J20<=Divers!$C$11,5,IF(J20<=Divers!$C$12,6,IF(J20<=Divers!$C$13,7,IF(J20<=Divers!$C$14,8))))))))","v":false}]
[]
[]
[]
[null,"Date:",null,null,null,null,{"$f":"IF(D24=\"\",\"\",(TEXT(D24,\"aaaa-mm-jj\")))","v":""},{"$f":"IF(F24=\"\",\"\",TEXT(F24,\"aaaa-mm-jj\"))","v":""},{"$f":"G24&\" \"&G26","v":" "}]
[]
[null,"Heure:",null,null,null,null,{"$f":"IF(D26=\"\",\"\",TEXT(D26,\"hh:mm\"))","v":""},{"$f":"IF(G26=\"\",\"\",TEXT(F26,\"hh:mm\"))","v":""},{"$f":"H24&\" \"&H26","v":" "},{"$f":"IFERROR(IF(I26-I24>0,I26-I24,\"\"),\"\")","v":""},{"$f":"IF(J26<=Divers!$C$7,1,IF(J26<=Divers!$C$8,2,IF(J26<=Divers!$C$9,3,IF(J26<=Divers!$C$10,4,IF(J26<=Divers!$C$11,5,IF(J26<=Divers!$C$12,6,IF(J26<=Divers!$C$13,7,IF(J26<=Divers!$C$14,8))))))))","v":false}]
[]
[]
[null,null,null,null,null,null,null,null,null,null,{"$f":"SUM(K12:K28)","v":0}]
[null,"Format date = aaaa-mm-jj"]
[null,"Format heure = hh:mm"]
[]
[null,"Ce tableau permet d'inscrire 8 périodes de 24 heures de garde maximum. Si le nombre de jours de garde est supérieur à 8, veuillez les inscrire dans les autres cellules."]
[]
[]
[null,"Commentaires:"]

{"sheet":"Stationnement","index":13,"n_rows":22,"n_cols":5,"rows_kept":22,"cut":false,"hidden":true,"merged":[[22,1,25,4]]}
[]
[]
[]
[]
[null,null,null,null,{"$f":"Général!L3","v":0}]
[]
[]
[null,"Remplir les cellules jaunes seulement, au besoin."]
[]
[]
[]
[null,"Coût du stationnement","$"]
[]
[null,"Est-ce que le montant payé pour le stationnement comprend les taxes ?","Oui / non \n/ ne sait pas"]
[]
[null,"Coût avant taxes:",null,{"$f":"IF(D14=\"oui\",D12/1.14975,D12)","v":0}]
[null,"TPS:",null,{"$f":"D16*0.05","v":0}]
[null,"TVQ:",null,{"$f":"D16*0.09975","v":0}]
[null,"Coût incluant les taxes:",null,{"$f":"D16+D17+D18","v":0}]
[]
[]
[null,"Commentaires:"]

{"sheet":"Choix","index":14,"n_rows":23,"n_cols":14,"rows_kept":23,"cut":false,"hidden":true,"merged":[[5,1,5,2],[10,1,10,2],[23,1,23,3],[12,1,12,2],[11,1,11,2],[15,1,15,2],[13,1,13,2],[14,1,14,2],[17,2,17,3]]}
[]
[]
[]
[]
[null,null,null,{"$f":"Général!L3","v":0}]
[null,{"$f":"IFERROR(IF('Calculs choix indemnité'!A10<'Calculs choix indemnité'!A12,\n\"La durée du transport est inférieure à 12 heures. Seuls les repas, s'il y a lieu, peuvent être remboursés.\",\nIF(AND('Calculs choix indemnité'!A10>'Calculs choix indemnité'!A12,Général!J65=2),\n\"La durée du transport est supérieure à 12 heures sans coucher. \"& 'Calculs choix indemnité'!A34,\nIF(AND('Calculs choix indemnité'!A10>'Calculs choix indemnité'!A12,Général!J65=1,'Calculs choix indemnité'!A10<'Calculs choix indemnité'!A13),\n\"La durée du transport se situe entre 12 et 18 heures.\"&'Calculs choix indemnité'!A34,\nIF(AND('Calculs choix indemnité'!A10>'Calculs choix indemnité'!A12,Général!J65=1,'Calculs choix indemnité'!A10<'Calculs choix indemnité'!A14),\n\"La durée du transport se situe entre 18 et 24 heures. Vous pouvez choisir de recevoir 100 % de l'indemnité journalière ou de demander le remboursement des dépenses réelles.\",\nIF(AND('Calculs choix indemnité'!A10>'Calculs choix indemnité'!A12,Général!J65=1,'Calculs choix indemnité'!A10>'Calculs choix indemnité'!A14),\n\"La durée du transport est supérieure à 24 heures. Vous pouvez choisir de recevoir 100 % de l'indemnité journalière plus les repas pris au-delà de cette période ou de demander le remboursement des dépenses réelles.\"))))),\"\")","v":""}]
[]
[null,"Pour vous aider dans votre choix:"]
[]
[null,"Calcul de l'indemnité à laquelle vous avez droit:",null,null,null,null,null,{"$f":"Général!J73","v":0}]
[null,{"$f":"IF(B6='Calculs choix indemnité'!G21,'Calculs choix indemnité'!A33,\nIF(Choix!B6='Calculs choix indemnité'!G22,'Calculs choix indemnité'!A34,\nIF(Choix!B6='Calculs choix indemnité'!G23,'Calculs choix indemnité'!A34,\nIF(Choix!B6='Calculs choix indemnité'!G24,'Calculs choix indemnité'!A35,\nIF(Choix!B6='Calculs choix indemnité'!G25,'Calculs choix indemnité'!A36,)))))","v":0}]
[null,{"$f":"IF('Calculs choix indemnité'!A10<='Calculs choix indemnité'!A12,\"Le transport a duré moins de 12 heures, vous ne pouvez effectuer un choix.\",\nIF(Général!J65=2,\"50 % de l'indemnité soit \"&H14&\",00 $ par préposé.\",\nIF(AND(Général!J65=1,Général!L65>='Calculs choix indemnité'!A12,Général!L65<'Calculs choix indemnité'!A13),\"50 % de l'indemnité soit \"&'Calculs choix indemnité'!D16&\",00 $ par préposé:\",\nIF(AND(Général!J65=1,Général!L65>='Calculs choix indemnité'!A10,Général!L65<'Calculs choix indemnité'!A14),\"100 % de l'indemnité soit \"&'Calculs choix indemnité'!E17&\",00 $ par préposé:\",\nIF('Calculs choix indemnité'!A10>='Calculs choix indemnité'!A14,\"100 % de l'indemnité soit \"&'Calculs choix indemnité'!E17&\",00 $ par préposé:\"))\n)))","v":{"$error":"#VALUE!"}},null,{"$f":"IF('Calculs choix indemnité'!A10<='Calculs choix indemnité'!A12,0,\nIF('Calculs choix indemnité'!A10>='Calculs choix indemnité'!A14,'Calculs choix indemnité'!E17*'Calculs choix indemnité'!F17,\nIF(AND('Calculs choix indemnité'!A10>='Calculs choix indemnité'!A12,Général!H65=\"non\"),H14*'Calculs choix indemnité'!F17,\nIF(AND('Calculs choix indemnité'!A10>='Calculs choix indemnité'!A12,'Calculs choix indemnité'!A10<='Calculs choix indemnité'!A13,Général!H65=\"oui\"),'Calculs choix indemnité'!D16*'Calculs choix indemnité'!F17,\nIF(AND('Calculs choix indemnité'!A10>='Calculs choix indemnité'!A13,'Calculs choix indemnité'!A10<='Calculs choix indemnité'!A14,Général!H65=\"oui\"),'Calculs choix indemnité'!E17*'Calculs choix indemnité'!F17,)))))","v":{"$error":"#VALUE!"}},null,null,null,{"$f":"IF(L16=\"2022\",L17,IF(M16=\"2023\",M17,IF(N16=\"2024\",N17,\"\")))","v":""},null,null,null,"2022-07-01","2023-07-01","2024-07-01"]
[null,{"$f":"IF('Calculs choix indemnité'!A10>='Calculs choix indemnité'!A14,\"Plus les repas pris au-delà des premiers 24 heures, s'il y a lieu:\",\"\")","v":{"$error":"#VALUE!"}},null,{"$f":"IF('Calculs choix indemnité'!A10>='Calculs choix indemnité'!A14,\nRepas!M75,\"\")","v":{"$error":"#VALUE!"}},null,null,null,{"$f":"IF(H12=\"oui\",\"haute saison\",\"basse saison\")","v":"basse saison"},null,null,null,"2022-11-01","2023-11-01","2024-11-01"]
[null,"Total:",null,{"$f":"SUM(D12:D13)","v":{"$error":"#VALUE!"}},null,null,null,{"$f":"INDEX(TAUX!G50:H58,MATCH(H10,TAUX!F50:F58,0),MATCH(H13,TAUX!G49:H49,0))","v":{"$error":"#N/A"}},null,null,null,"2022-01-01","2023-01-01","2024-01-01"]
[null,"OU",null,null,null,null,null,null,null,null,null,"2022-12-31","2023-12-31","2024-12-31"]
[null,{"$f":"IF(AND('Calculs choix indemnité'!A10>'Calculs choix indemnité'!A12,Général!H65=\"non\"),\"Dépenses relatives aux repas (excluant les pourboires)\",\n \"Dépenses relatives aux repas (excluant les pourboires) et à l'hébergement que vous avez déjà inscrites:\")","v":{"$error":"#VALUE!"}},null,{"$f":"IF(Général!H65=\"non\",\nRepas!M42,\nRepas!M42+Repas!M75+Hébergement!F27)","v":0},null,null,null,null,null,null,null,{"$f":"IF(AND(Général!G14>=L14,Général!G14<=L15),\"2022\",\"non\")","v":"non"},{"$f":"IF(AND(Général!G14>=M14,Général!G14<=M15),\"2023\",\"non\")","v":"non"},{"$f":"IF(AND(Général!G14>=N14,Général!G14<=N15),\"2024\",\"non\")","v":"non"}]
[null,null,null,null,null,null,null,null,null,null,null,{"$f":"IF(AND(Général!G14>=Choix!L12,Général!G14<Choix!L13),\"oui\",\"non\")","v":"non"},{"$f":"IF(AND(Général!G14>=Choix!M12,Général!G14<M13),\"oui\",\"non\")","v":"non"},{"$f":"IF(AND(Général!G14>=Choix!N12,Général!G14<N13),\"oui\",\"non\")","v":"non"}]
[null,"Faites votre choix ici:"]
[]
[]
[null,null,null,{"$f":"IF(AND(C17=1,D14=0),\"Vous devez choisir Dépenses réelles\",\nIF(C17=1,D14,\nIF(AND(C17=2,D14=0),D16,\nIF(C17=2,D16))))","v":{"$error":"#VALUE!"}}]
[]
[null,"Commentaires:"]

{"sheet":"Jours fériés","index":15,"n_rows":1829,"n_cols":10,"rows_kept":1829,"cut":false,"hidden":true,"merged":[[0,1,0,3],[2,4,2,5],[0,4,0,9]]}
[null,"Liste des jours fériés 2022 à 2025",null,null,"Calendrier des jours fériés 2022 à 2025"]
[]
[null,"Calendrier 2021 à 2025","S ou FDS","F","Événement",null,2022,2023,2024,2025]
[null,"2021-01-01","s","Oui",null,"Jour de l'An","samedi 1er janvier 2022","dimanche 1er janvier 2023","lundi 1er janvier 2024","mercredi 1er janvier 2025"]
[null,"2021-01-02","fds","Oui",null,"Lendemain du jour de l'An","dimanche 2 janvier 2022","lundi 2 janvier 2023","mardi 2 janvier 2024","jeudi 2 janvier 2025"]
[null,"2021-01-03","fds",null,null,"Vendredi saint","vendredi 15 avril 2022","vendredi 7 avril 2023","vendredi 29 mars 2024","vendredi 18 avril 2025"]
[null,"2021-01-04","s",null,null,"Lundi de Pâques","lundi 18 avril 2022","lundi 10 avril 2023","lundi 1er avril 2024","lundi 21 avril 2025"]
[null,"2021-01-05","s",null,null,"Journée internationale des Patriotes","lundi 23 mai 2022","lundi 22 mai 2023","lundi 20 mai 2024","lundi 19 mai 2025"]
[null,"2021-01-06","s",null,null,"Fête nationale du Québec","vendredi 24 juin 2022","samedi 24 juin 2023","lundi 24 juin 2024","mardii 24 juin 2025"]
[null,"2021-01-07","s",null,null,"Fête du Canada","vendredi 1er juillet 2022","samedi 1er juillet 2023","lundi 1er juillet 2024","mardi 1er juillet 2025"]
[null,"2021-01-08","s",null,null,"Fête du Travail","lundi 5 septembre 2022","lundi 4 septembre 2023","lundi 2 septembre 2024","lundi 1er septembre 2025"]
[null,"2021-01-09","fds",null,null,"Fête de l'Action de grâces","lundi 10 octobre 2022","lundi 9 octobre 2023","lundi 14 octobre 2024","lundi 13 octobre 2025"]
[null,"2021-01-10","fds",null,null,"Veille de Noël","samedi 24 décembre 2022","dimanche 24 décembre 2023","mardi 24 décembre 2024","mercredi 24 décembre 2025"]
[null,"2021-01-11","s",null,null,"Noël","dimanche 25 décembre 2022","lundi 25 décembre 2023","mercredi 25 décembre 2024","jeudi 25 décembre 2025"]
[null,"2021-01-12","s",null,null,"Lendemain de Noël","lundi 26 décembre 2022","mardi 26 décembre 2023","jeudi 26 décembre 2024","vendredi 26 décembre 2025"]
[null,"2021-01-13","s",null,null,"Veille du Jour de l'An","samedi 31 décembre 2022","dimanche 31 décembre 2023","mardi 31 décembre 2024","mercredi 31 décembre 2025"]
[null,"2021-01-14","s"]
[null,"2021-01-15","s"]
[null,"2021-01-16","fds"]
[null,"2021-01-17","fds",null,"LE CALENDRIER DOIT:"]
[null,"2021-01-18","s",null,"- ÊTRE TRANSFÉRÉ SUR UNE SEULE PAGE ET DÉPOSÉ DANS LA SECTION PARTENAIRE DU SITE DU BC"]
[null,"2021-01-19","s",null,"- ÊTRE INTÉGRÉ DANS LE DOCUMENT DE FORMATION À TITRE DE RÉFÉRENCE"]
[null,"2021-01-20","s"]
[null,"2021-01-21","s"]
[null,"2021-01-22","s",null,"LA LISTE DES JOURS FÉRIÉS: "]
[null,"2021-01-23","fds",null,"- EST S'ÉTEND DE 2021 À 2025"]
[null,"2021-01-24","fds",null,"- ELLE SERT DANS LE CALCUL DU TEMPS D'ATTENTE. NE PAS EFFACER."]
[null,"2021-01-25","s"]
[null,"2021-01-26","s"]
[null,"2021-01-27","s",null,"1er trsp","2e trsp","3e trsp","4e trsp"]
[null,"2021-01-28","s",null,{"$f":"IF(VLOOKUP(Général!$G14,$B$4:$D$1829,2,FALSE)=\"s\",\"jour de semaine\",\"jour de fin de semaine\")","v":{"$error":"#N/A"}},{"$f":"IF(VLOOKUP(#REF!,$B44:$D$1829,2,FALSE)=\"s\",\"Jour de semaine\",\"Jour de fin de semaine\")","v":{"$error":"#REF!"}},{"$f":"IF(VLOOKUP(#REF!,$B4:$D$1829,2,FALSE)=\"s\",\"Jour de semaine\",\"Jour de fin de semaine\")","v":{"$error":"#REF!"}},{"$f":"IF(VLOOKUP(#REF!,$B4:$D$1829,2,FALSE)=\"s\",\"Jour de semaine\",\"Jour de fin de semaine\")","v":{"$error":"#REF!"}}]
[null,"2021-01-29","s",null,{"$f":"IF(VLOOKUP(Général!$G14,$B$4:$D$1829,3,FALSE)=\"oui\",\"férié\",\"non férié\")","v":{"$error":"#N/A"}},{"$f":"IF(VLOOKUP(#REF!,$B45:$D$1829,3,FALSE)=\"oui\",\"férié\",\"non férié\")","v":{"$error":"#REF!"}},{"$f":"IF(VLOOKUP(#REF!,$B4:$D$1829,3,FALSE)=\"oui\",\"férié\",\"non férié\")","v":{"$error":"#REF!"}},{"$f":"IF(VLOOKUP(#REF!,$B4:$D$1829,3,FALSE)=\"oui\",\"férié\",\"non férié\")","v":{"$error":"#REF!"}}]
[null,"2021-01-30","fds"]
[null,"2021-01-31","fds",null,{"$f":"IF(VLOOKUP(Général!$L14,$B$4:$D$1829,2,FALSE)=\"s\",\"jour de semaine\",\"jour de fin de semaine\")","v":{"$error":"#N/A"}},{"$f":"IF(VLOOKUP(#REF!,$B47:$D$1829,2,FALSE)=\"s\",\"Jour de semaine\",\"Jour de fin de semaine\")","v":{"$error":"#REF!"}},{"$f":"IF(VLOOKUP(#REF!,$B4:$D$1829,2,FALSE)=\"s\",\"Jour de semaine\",\"Jour de fin de semaine\")","v":{"$error":"#REF!"}},{"$f":"IF(VLOOKUP(#REF!,$B4:$D$1829,2,FALSE)=\"s\",\"Jour de semaine\",\"Jour de fin de semaine\")","v":{"$error":"#REF!"}}]
[null,"2021-02-01","s",null,{"$f":"IF(VLOOKUP(Général!$L14,$B$4:$D$1829,3,FALSE)=\"oui\",\"férié\",\"non férié\")","v":{"$error":"#N/A"}},{"$f":"IF(VLOOKUP(#REF!,$B48:$D$1829,3,FALSE)=\"oui\",\"férié\",\"non férié\")","v":{"$error":"#REF!"}},{"$f":"IF(VLOOKUP(#REF!,$B4:$D$1829,3,FALSE)=\"oui\",\"férié\",\"non férié\")","v":{"$error":"#REF!"}},{"$f":"IF(VLOOKUP(#REF!,$B4:$D$1829,3,FALSE)=\"oui\",\"férié\",\"non férié\")","v":{"$error":"#REF!"}}]
[null,"2021-02-02","s"]
[null,"2021-02-03","s"]
[null,"2021-02-04","s"]
[null,"2021-02-05","s"]
[null,"2021-02-06","fds"]
[null,"2021-02-07","fds"]
[null,"2021-02-08","s"]
[null,"2021-02-09","s"]
[null,"2021-02-10","s"]
[null,"2021-02-11","s"]
[null,"2021-02-12","s"]
[null,"2021-02-13","fds"]
[null,"2021-02-14","fds"]
[null,"2021-02-15","s"]
[null,"2021-02-16","s"]
[null,"2021-02-17","s"]
[null,"2021-02-18","s"]
[null,"2021-02-19","s"]
[null,"2021-02-20","fds"]
[null,"2021-02-21","fds"]
[null,"2021-02-22","s"]
[null,"2021-02-23","s"]
[null,"2021-02-24","s"]
[null,"2021-02-25","s"]
[null,"2021-02-26","s"]
[null,"2021-02-27","fds"]
[null,"2021-02-28","fds"]
[null,"2021-03-01","s"]
[null,"2021-03-02","s"]
[null,"2021-03-03","s"]
[null,"2021-03-04","s"]
[null,"2021-03-05","s"]
[null,"2021-03-06","fds"]
[null,"2021-03-07","fds"]
[null,"2021-03-08","s"]
[null,"2021-03-09","s"]
[null,"2021-03-10","s"]
[null,"2021-03-11","s"]
[null,"2021-03-12","s"]
[null,"2021-03-13","fds"]
[null,"2021-03-14","fds"]
[null,"2021-03-15","s"]
[null,"2021-03-16","s"]
[null,"2021-03-17","s"]
[null,"2021-03-18","s"]
[null,"2021-03-19","s"]
[null,"2021-03-20","fds"]
[null,"2021-03-21","fds"]
[null,"2021-03-22","s"]
[null,"2021-03-23","s"]
[null,"2021-03-24","s"]
[null,"2021-03-25","s"]
[null,"2021-03-26","s"]
[null,"2021-03-27","fds"]
[null,"2021-03-28","fds"]
[null,"2021-03-29","s"]
[null,"2021-03-30","s"]
[null,"2021-03-31","s"]
[null,"2021-04-01","s"]
[null,"2021-04-02","s","Oui"]
[null,"2021-04-03","fds"]
[null,"2021-04-04","fds"]
[null,"2021-04-05","s","Oui"]
[null,"2021-04-06","s"]
[null,"2021-04-07","s"]
[null,"2021-04-08","s"]
[null,"2021-04-09","s"]
[null,"2021-04-10","fds"]
[null,"2021-04-11","fds"]
[null,"2021-04-12","s"]
[null,"2021-04-13","s"]
[null,"2021-04-14","s"]
[null,"2021-04-15","s"]
[null,"2021-04-16","s"]
[null,"2021-04-17","fds"]
[null,"2021-04-18","fds"]
[null,"2021-04-19","s"]
[null,"2021-04-20","s"]
[null,"2021-04-21","s"]
[null,"2021-04-22","s"]
[null,"2021-04-23","s"]
[null,"2021-04-24","fds"]
[null,"2021-04-25","fds"]
[null,"2021-04-26","s"]
[null,"2021-04-27","s"]
[null,"2021-04-28","s"]
[null,"2021-04-29","s"]
[null,"2021-04-30","s"]
[null,"2021-05-01","fds"]
[null,"2021-05-02","fds"]
[null,"2021-05-03","s"]
[null,"2021-05-04","s"]
[null,"2021-05-05","s"]
[null,"2021-05-06","s"]
[null,"2021-05-07","s"]
[null,"2021-05-08","fds"]
[null,"2021-05-09","fds"]
[null,"2021-05-10","s"]
[null,"2021-05-11","s"]
[null,"2021-05-12","s"]
[null,"2021-05-13","s"]
[null,"2021-05-14","s"]
[null,"2021-05-15","fds"]
[null,"2021-05-16","fds"]
[null,"2021-05-17","s"]
[null,"2021-05-18","s"]
[null,"2021-05-19","s"]
[null,"2021-05-20","s"]
[null,"2021-05-21","s"]
[null,"2021-05-22","fds"]
[null,"2021-05-23","fds"]
[null,"2021-05-24","s","Oui"]
[null,"2021-05-25","s"]
[null,"2021-05-26","s"]
[null,"2021-05-27","s"]
[null,"2021-05-28","s"]
[null,"2021-05-29","fds"]
[null,"2021-05-30","fds"]
[null,"2021-05-31","s"]
[null,"2021-06-01","s"]
[null,"2021-06-02","s"]
[null,"2021-06-03","s"]
[null,"2021-06-04","s"]
[null,"2021-06-05","fds"]
[null,"2021-06-06","fds"]
[null,"2021-06-07","s"]
[null,"2021-06-08","s"]
[null,"2021-06-09","s"]
[null,"2021-06-10","s"]
[null,"2021-06-11","s"]
[null,"2021-06-12","fds"]
[null,"2021-06-13","fds"]
[null,"2021-06-14","s"]
[null,"2021-06-15","s"]
[null,"2021-06-16","s"]
[null,"2021-06-17","s"]
[null,"2021-06-18","s"]
[null,"2021-06-19","fds"]
[null,"2021-06-20","fds"]
[null,"2021-06-21","s"]
[null,"2021-06-22","s"]
[null,"2021-06-23","s"]
[null,"2021-06-24","s","Oui"]
[null,"2021-06-25","s"]
[null,"2021-06-26","fds"]
[null,"2021-06-27","fds"]
[null,"2021-06-28","s"]
[null,"2021-06-29","s"]
[null,"2021-06-30","s"]
[null,"2021-07-01","s","Oui"]
[null,"2021-07-02","s"]
[null,"2021-07-03","fds"]
[null,"2021-07-04","fds"]
[null,"2021-07-05","s"]
[null,"2021-07-06","s"]
[null,"2021-07-07","s"]
[null,"2021-07-08","s"]
[null,"2021-07-09","s"]
[null,"2021-07-10","fds"]
[null,"2021-07-11","fds"]
[null,"2021-07-12","s"]
[null,"2021-07-13","s"]
[null,"2021-07-14","s"]
[null,"2021-07-15","s"]
[null,"2021-07-16","s"]
[null,"2021-07-17","fds"]
[null,"2021-07-18","fds"]
[null,"2021-07-19","s"]
[null,"2021-07-20","s"]
[null,"2021-07-21","s"]
[null,"2021-07-22","s"]
[null,"2021-07-23","s"]
[null,"2021-07-24","fds"]
[null,"2021-07-25","fds"]
[null,"2021-07-26","s"]
[null,"2021-07-27","s"]
[null,"2021-07-28","s"]
[null,"2021-07-29","s"]
[null,"2021-07-30","s"]
[null,"2021-07-31","fds"]
[null,"2021-08-01","fds"]
[null,"2021-08-02","s"]
[null,"2021-08-03","s"]
[null,"2021-08-04","s"]
[null,"2021-08-05","s"]
[null,"2021-08-06","s"]
[null,"2021-08-07","fds"]
[null,"2021-08-08","fds"]
[null,"2021-08-09","s"]
[null,"2021-08-10","s"]
[null,"2021-08-11","s"]
[null,"2021-08-12","s"]
[null,"2021-08-13","s"]
[null,"2021-08-14","fds"]
[null,"2021-08-15","fds"]
[null,"2021-08-16","s"]
[null,"2021-08-17","s"]
[null,"2021-08-18","s"]
[null,"2021-08-19","s"]
[null,"2021-08-20","s"]
[null,"2021-08-21","fds"]
[null,"2021-08-22","fds"]
[null,"2021-08-23","s"]
[null,"2021-08-24","s"]
[null,"2021-08-25","s"]
[null,"2021-08-26","s"]
[null,"2021-08-27","s"]
[null,"2021-08-28","fds"]
[null,"2021-08-29","fds"]
[null,"2021-08-30","s"]
[null,"2021-08-31","s"]
[null,"2021-09-01","s"]
[null,"2021-09-02","s"]
[null,"2021-09-03","s"]
[null,"2021-09-04","fds"]
[null,"2021-09-05","fds"]
[null,"2021-09-06","s","Oui"]
[null,"2021-09-07","s"]
[null,"2021-09-08","s"]
[null,"2021-09-09","s"]
[null,"2021-09-10","s"]
[null,"2021-09-11","fds"]
[null,"2021-09-12","fds"]
[null,"2021-09-13","s"]
[null,"2021-09-14","s"]
[null,"2021-09-15","s"]
[null,"2021-09-16","s"]
[null,"2021-09-17","s"]
[null,"2021-09-18","fds"]
[null,"2021-09-19","fds"]
[null,"2021-09-20","s"]
[null,"2021-09-21","s"]
[null,"2021-09-22","s"]
[null,"2021-09-23","s"]
[null,"2021-09-24","s"]
[null,"2021-09-25","fds"]
[null,"2021-09-26","fds"]
[null,"2021-09-27","s"]
[null,"2021-09-28","s"]
[null,"2021-09-29","s"]
[null,"2021-09-30","s"]
[null,"2021-10-01","s"]
[null,"2021-10-02","fds"]
[null,"2021-10-03","fds"]
[null,"2021-10-04","s"]
[null,"2021-10-05","s"]
[null,"2021-10-06","s"]
[null,"2021-10-07","s"]
[null,"2021-10-08","s"]
[null,"2021-10-09","fds"]
[null,"2021-10-10","fds"]
[null,"2021-10-11","s","Oui"]
[null,"2021-10-12","s"]
[null,"2021-10-13","s"]
[null,"2021-10-14","s"]
[null,"2021-10-15","s"]
[null,"2021-10-16","fds"]
[null,"2021-10-17","fds"]
[null,"2021-10-18","s"]
[null,"2021-10-19","s"]
[null,"2021-10-20","s"]
[null,"2021-10-21","s"]
[null,"2021-10-22","s"]
[null,"2021-10-23","fds"]
[null,"2021-10-24","fds"]
[null,"2021-10-25","s"]
[null,"2021-10-26","s"]
[null,"2021-10-27","s"]
[null,"2021-10-28","s"]
[null,"2021-10-29","s"]
[null,"2021-10-30","fds"]
[null,"2021-10-31","fds"]
[null,"2021-11-01","s"]
[null,"2021-11-02","s"]
[null,"2021-11-03","s"]
[null,"2021-11-04","s"]
[null,"2021-11-05","s"]
[null,"2021-11-06","fds"]
[null,"2021-11-07","fds"]
[null,"2021-11-08","s"]
[null,"2021-11-09","s"]
[null,"2021-11-10","s"]
[null,"2021-11-11","s"]
[null,"2021-11-12","s"]
[null,"2021-11-13","fds"]
[null,"2021-11-14","fds"]
[null,"2021-11-15","s"]
[null,"2021-11-16","s"]
[null,"2021-11-17","s"]
[null,"2021-11-18","s"]
[null,"2021-11-19","s"]
[null,"2021-11-20","fds"]
[null,"2021-11-21","fds"]
[null,"2021-11-22","s"]
[null,"2021-11-23","s"]
[null,"2021-11-24","s"]
[null,"2021-11-25","s"]
[null,"2021-11-26","s"]
[null,"2021-11-27","fds"]
[null,"2021-11-28","fds"]
[null,"2021-11-29","s"]
[null,"2021-11-30","s"]
[null,"2021-12-01","s"]
[null,"2021-12-02","s"]
[null,"2021-12-03","s"]
[null,"2021-12-04","fds"]
[null,"2021-12-05","fds"]
[null,"2021-12-06","s"]
[null,"2021-12-07","s"]
[null,"2021-12-08","s"]
[null,"2021-12-09","s"]
[null,"2021-12-10","s"]
[null,"2021-12-11","fds"]
[null,"2021-12-12","fds"]
[null,"2021-12-13","s"]
[null,"2021-12-14","s"]
[null,"2021-12-15","s"]
[null,"2021-12-16","s"]
[null,"2021-12-17","s"]
[null,"2021-12-18","fds"]
[null,"2021-12-19","fds"]
[null,"2021-12-20","s"]
[null,"2021-12-21","s"]
[null,"2021-12-22","s"]
[null,"2021-12-23","s"]
[null,"2021-12-24","s","Oui"]
[null,"2021-12-25","fds","Oui"]
[null,"2021-12-26","fds","Oui"]
[null,"2021-12-27","s"]
[null,"2021-12-28","s"]
[null,"2021-12-29","s"]
[null,"2021-12-30","s"]
[null,"2021-12-31","s","Oui"]
[null,"2022-01-01","fds","Oui"]
[null,"2022-01-02","fds","Oui"]
[null,"2022-01-03","s"]
[null,"2022-01-04","s"]
[null,"2022-01-05","s"]
[null,"2022-01-06","s"]
[null,"2022-01-07","s"]
[null,"2022-01-08","fds"]
[null,"2022-01-09","fds"]
[null,"2022-01-10","s"]
[null,"2022-01-11","s"]
[null,"2022-01-12","s"]
[null,"2022-01-13","s"]
[null,"2022-01-14","s"]
[null,"2022-01-15","fds"]
[null,"2022-01-16","fds"]
[null,"2022-01-17","s"]
[null,"2022-01-18","s"]
[null,"2022-01-19","s"]
[null,"2022-01-20","s"]
[null,"2022-01-21","s"]
[null,"2022-01-22","fds"]
[null,"2022-01-23","fds"]
[null,"2022-01-24","s"]
[null,"2022-01-25","s"]
[null,"2022-01-26","s"]
[null,"2022-01-27","s"]
[null,"2022-01-28","s"]
[null,"2022-01-29","fds"]
[null,"2022-01-30","fds"]
[null,"2022-01-31","s"]
[null,"2022-02-01","s"]
[null,"2022-02-02","s"]
[null,"2022-02-03","s"]
[null,"2022-02-04","s"]
[null,"2022-02-05","fds"]
[null,"2022-02-06","fds"]
[null,"2022-02-07","s"]
[null,"2022-02-08","s"]
[null,"2022-02-09","s"]
[null,"2022-02-10","s"]
[null,"2022-02-11","s"]
[null,"2022-02-12","fds"]
[null,"2022-02-13","fds"]
[null,"2022-02-14","s"]
[null,"2022-02-15","s"]
[null,"2022-02-16","s"]
[null,"2022-02-17","s"]
[null,"2022-02-18","s"]
[null,"2022-02-19","fds"]
[null,"2022-02-20","fds"]
[null,"2022-02-21","s"]
[null,"2022-02-22","s"]
[null,"2022-02-23","s"]
[null,"2022-02-24","s"]
[null,"2022-02-25","s"]
[null,"2022-02-26","fds"]
[null,"2022-02-27","fds"]
[null,"2022-02-28","s"]
[null,"2022-03-01","s"]
[null,"2022-03-02","s"]
[null,"2022-03-03","s"]
[null,"2022-03-04","s"]
[null,"2022-03-05","fds"]
[null,"2022-03-06","fds"]
[null,"2022-03-07","s"]
[null,"2022-03-08","s"]
[null,"2022-03-09","s"]
[null,"2022-03-10","s"]
[null,"2022-03-11","s"]
[null,"2022-03-12","fds"]
[null,"2022-03-13","fds"]
[null,"2022-03-14","s"]
[null,"2022-03-15","s"]
[null,"2022-03-16","s"]
[null,"2022-03-17","s"]
[null,"2022-03-18","s"]
[null,"2022-03-19","fds"]
[null,"2022-03-20","fds"]
[null,"2022-03-21","s"]
[null,"2022-03-22","s"]
[null,"2022-03-23","s"]
[null,"2022-03-24","s"]
[null,"2022-03-25","s"]
[null,"2022-03-26","fds"]
[null,"2022-03-27","fds"]
[null,"2022-03-28","s"]
[null,"2022-03-29","s"]
[null,"2022-03-30","s"]
[null,"2022-03-31","s"]
[null,"2022-04-01","s"]
[null,"2022-04-02","fds"]
[null,"2022-04-03","fds"]
[null,"2022-04-04","s"]
[null,"2022-04-05","s"]
[null,"2022-04-06","s"]
[null,"2022-04-07","s"]
[null,"2022-04-08","s"]
[null,"2022-04-09","fds"]
[null,"2022-04-10","fds"]
[null,"2022-04-11","s"]
[null,"2022-04-12","s"]
[null,"2022-04-13","s"]
[null,"2022-04-14","s"]
[null,"2022-04-15","s","Oui"]
[null,"2022-04-16","fds"]
[null,"2022-04-17","fds"]
[null,"2022-04-18","s","Oui"]
[null,"2022-04-19","s"]
[null,"2022-04-20","s"]
[null,"2022-04-21","s"]
[null,"2022-04-22","s"]
[null,"2022-04-23","fds"]
[null,"2022-04-24","fds"]
[null,"2022-04-25","s"]
[null,"2022-04-26","s"]
[null,"2022-04-27","s"]
[null,"2022-04-28","s"]
[null,"2022-04-29","s"]
[null,"2022-04-30","fds"]
[null,"2022-05-01","fds"]
[null,"2022-05-02","s"]
[null,"2022-05-03","s"]
[null,"2022-05-04","s"]
[null,"2022-05-05","s"]
[null,"2022-05-06","s"]
[null,"2022-05-07","fds"]
[null,"2022-05-08","fds"]
[null,"2022-05-09","s"]
[null,"2022-05-10","s"]
[null,"2022-05-11","s"]
[null,"2022-05-12","s"]
[null,"2022-05-13","s"]
[null,"2022-05-14","fds"]
[null,"2022-05-15","fds"]
[null,"2022-05-16","s"]
[null,"2022-05-17","s"]
[null,"2022-05-18","s"]
[null,"2022-05-19","s"]
[null,"2022-05-20","s"]
[null,"2022-05-21","fds"]
[null,"2022-05-22","fds"]
[null,"2022-05-23","s","Oui"]
[null,"2022-05-24","s"]
[null,"2022-05-25","s"]
[null,"2022-05-26","s"]
[null,"2022-05-27","s"]
[null,"2022-05-28","fds"]
[null,"2022-05-29","fds"]
[null,"2022-05-30","s"]
[null,"2022-05-31","s"]
[null,"2022-06-01","s"]
[null,"2022-06-02","s"]
[null,"2022-06-03","s"]
[null,"2022-06-04","fds"]
[null,"2022-06-05","fds"]
[null,"2022-06-06","s"]
[null,"2022-06-07","s"]
[null,"2022-06-08","s"]
[null,"2022-06-09","s"]
[null,"2022-06-10","s"]
[null,"2022-06-11","fds"]
[null,"2022-06-12","fds"]
[null,"2022-06-13","s"]
[null,"2022-06-14","s"]
[null,"2022-06-15","s"]
[null,"2022-06-16","s"]
[null,"2022-06-17","s"]
[null,"2022-06-18","fds"]
[null,"2022-06-19","fds"]
[null,"2022-06-20","s"]
[null,"2022-06-21","s"]
[null,"2022-06-22","s"]
[null,"2022-06-23","s"]
[null,"2022-06-24","s","Oui"]
[null,"2022-06-25","fds"]
[null,"2022-06-26","fds"]
[null,"2022-06-27","s"]
[null,"2022-06-28","s"]
[null,"2022-06-29","s"]
[null,"2022-06-30","s"]
[null,"2022-07-01","s","Oui"]
[null,"2022-07-02","fds"]
[null,"2022-07-03","fds"]
[null,"2022-07-04","s"]
[null,"2022-07-05","s"]
[null,"2022-07-06","s"]
[null,"2022-07-07","s"]
[null,"2022-07-08","s"]
[null,"2022-07-09","fds"]
[null,"2022-07-10","fds"]
[null,"2022-07-11","s"]
[null,"2022-07-12","s"]
[null,"2022-07-13","s"]
[null,"2022-07-14","s"]
[null,"2022-07-15","s"]
[null,"2022-07-16","fds"]
[null,"2022-07-17","fds"]
[null,"2022-07-18","s"]
[null,"2022-07-19","s"]
[null,"2022-07-20","s"]
[null,"2022-07-21","s"]
[null,"2022-07-22","s"]
[null,"2022-07-23","fds"]
[null,"2022-07-24","fds"]
[null,"2022-07-25","s"]
[null,"2022-07-26","s"]
[null,"2022-07-27","s"]
[null,"2022-07-28","s"]
[null,"2022-07-29","s"]
[null,"2022-07-30","fds"]
[null,"2022-07-31","fds"]
[null,"2022-08-01","s"]
[null,"2022-08-02","s"]
[null,"2022-08-03","s"]
[null,"2022-08-04","s"]
[null,"2022-08-05","s"]
[null,"2022-08-06","fds"]
[null,"2022-08-07","fds"]
[null,"2022-08-08","s"]
[null,"2022-08-09","s"]
[null,"2022-08-10","s"]
[null,"2022-08-11","s"]
[null,"2022-08-12","s"]
[null,"2022-08-13","fds"]
[null,"2022-08-14","fds"]
[null,"2022-08-15","s"]
[null,"2022-08-16","s"]
[null,"2022-08-17","s"]
[null,"2022-08-18","s"]
[null,"2022-08-19","s"]
[null,"2022-08-20","fds"]
[null,"2022-08-21","fds"]
[null,"2022-08-22","s"]
[null,"2022-08-23","s"]
[null,"2022-08-24","s"]
[null,"2022-08-25","s"]
[null,"2022-08-26","s"]
[null,"2022-08-27","fds"]
[null,"2022-08-28","fds"]
[null,"2022-08-29","s"]
[null,"2022-08-30","s"]
[null,"2022-08-31","s"]
[null,"2022-09-01","s"]
[null,"2022-09-02","s"]
[null,"2022-09-03","fds"]
[null,"2022-09-04","fds"]
[null,"2022-09-05","s","Oui"]
[null,"2022-09-06","s"]
[null,"2022-09-07","s"]
[null,"2022-09-08","s"]
[null,"2022-09-09","s"]
[null,"2022-09-10","fds"]
[null,"2022-09-11","fds"]
[null,"2022-09-12","s"]
[null,"2022-09-13","s"]
[null,"2022-09-14","s"]
[null,"2022-09-15","s"]
[null,"2022-09-16","s"]
[null,"2022-09-17","fds"]
[null,"2022-09-18","fds"]
[null,"2022-09-19","s"]
[null,"2022-09-20","s"]
[null,"2022-09-21","s"]
[null,"2022-09-22","s"]
[null,"2022-09-23","s"]
[null,"2022-09-24","fds"]
[null,"2022-09-25","fds"]
[null,"2022-09-26","s"]
[null,"2022-09-27","s"]
[null,"2022-09-28","s"]
[null,"2022-09-29","s"]
[null,"2022-09-30","s"]
[null,"2022-10-01","fds"]
[null,"2022-10-02","fds"]
[null,"2022-10-03","s"]
[null,"2022-10-04","s"]
[null,"2022-10-05","s"]
[null,"2022-10-06","s"]
[null,"2022-10-07","s"]
[null,"2022-10-08","fds"]
[null,"2022-10-09","fds"]
[null,"2022-10-10","s","Oui"]
[null,"2022-10-11","s"]
[null,"2022-10-12","s"]
[null,"2022-10-13","s"]
[null,"2022-10-14","s"]
[null,"2022-10-15","fds"]
[null,"2022-10-16","fds"]
[null,"2022-10-17","s"]
[null,"2022-10-18","s"]
[null,"2022-10-19","s"]
[null,"2022-10-20","s"]
[null,"2022-10-21","s"]
[null,"2022-10-22","fds"]
[null,"2022-10-23","fds"]
[null,"2022-10-24","s"]
[null,"2022-10-25","s"]
[null,"2022-10-26","s"]
[null,"2022-10-27","s"]
[null,"2022-10-28","s"]
[null,"2022-10-29","fds"]
[null,"2022-10-30","fds"]
[null,"2022-10-31","s"]
[null,"2022-11-01","s"]
[null,"2022-11-02","s"]
[null,"2022-11-03","s"]
[null,"2022-11-04","s"]
[null,"2022-11-05","fds"]
[null,"2022-11-06","fds"]
[null,"2022-11-07","s"]
[null,"2022-11-08","s"]
[null,"2022-11-09","s"]
[null,"2022-11-10","s"]
[null,"2022-11-11","s"]
[null,"2022-11-12","fds"]
[null,"2022-11-13","fds"]
[null,"2022-11-14","s"]
[null,"2022-11-15","s"]
[null,"2022-11-16","s"]
[null,"2022-11-17","s"]
[null,"2022-11-18","s"]
[null,"2022-11-19","fds"]
[null,"2022-11-20","fds"]
[null,"2022-11-21","s"]
[null,"2022-11-22","s"]
[null,"2022-11-23","s"]
[null,"2022-11-24","s"]
[null,"2022-11-25","s"]
[null,"2022-11-26","fds"]
[null,"2022-11-27","fds"]
[null,"2022-11-28","s"]
[null,"2022-11-29","s"]
[null,"2022-11-30","s"]
[null,"2022-12-01","s"]
[null,"2022-12-02","s"]
[null,"2022-12-03","fds"]
[null,"2022-12-04","fds"]
[null,"2022-12-05","s"]
[null,"2022-12-06","s"]
[null,"2022-12-07","s"]
[null,"2022-12-08","s"]
[null,"2022-12-09","s"]
[null,"2022-12-10","fds"]
[null,"2022-12-11","fds"]
[null,"2022-12-12","s"]
[null,"2022-12-13","s"]
[null,"2022-12-14","s"]
[null,"2022-12-15","s"]
[null,"2022-12-16","s"]
[null,"2022-12-17","fds"]
[null,"2022-12-18","fds"]
[null,"2022-12-19","s"]
[null,"2022-12-20","s"]
[null,"2022-12-21","s"]
[null,"2022-12-22","s"]
[null,"2022-12-23","s"]
[null,"2022-12-24","fds","Oui"]
[null,"2022-12-25","fds","Oui"]
[null,"2022-12-26","s","Oui"]
[null,"2022-12-27","s"]
[null,"2022-12-28","s"]
[null,"2022-12-29","s"]
[null,"2022-12-30","s"]
[null,"2022-12-31","fds","Oui"]
[null,"2023-01-01","fds","Oui"]
[null,"2023-01-02","s","Oui"]
[null,"2023-01-03","s"]
[null,"2023-01-04","s"]
[null,"2023-01-05","s"]
[null,"2023-01-06","s"]
[null,"2023-01-07","fds"]
[null,"2023-01-08","fds"]
[null,"2023-01-09","s"]
[null,"2023-01-10","s"]
[null,"2023-01-11","s"]
[null,"2023-01-12","s"]
[null,"2023-01-13","s"]
[null,"2023-01-14","fds"]
[null,"2023-01-15","fds"]
[null,"2023-01-16","s"]
[null,"2023-01-17","s"]
[null,"2023-01-18","s"]
[null,"2023-01-19","s"]
[null,"2023-01-20","s"]
[null,"2023-01-21","fds"]
[null,"2023-01-22","fds"]
[null,"2023-01-23","s"]
[null,"2023-01-24","s"]
[null,"2023-01-25","s"]
[null,"2023-01-26","s"]
[null,"2023-01-27","s"]
[null,"2023-01-28","fds"]
[null,"2023-01-29","fds"]
[null,"2023-01-30","s"]
[null,"2023-01-31","s"]
[null,"2023-02-01","s"]
[null,"2023-02-02","s"]
[null,"2023-02-03","s"]
[null,"2023-02-04","fds"]
[null,"2023-02-05","fds"]
[null,"2023-02-06","s"]
[null,"2023-02-07","s"]
[null,"2023-02-08","s"]
[null,"2023-02-09","s"]
[null,"2023-02-10","s"]
[null,"2023-02-11","fds"]
[null,"2023-02-12","fds"]
[null,"2023-02-13","s"]
[null,"2023-02-14","s"]
[null,"2023-02-15","s"]
[null,"2023-02-16","s"]
[null,"2023-02-17","s"]
[null,"2023-02-18","fds"]
[null,"2023-02-19","fds"]
[null,"2023-02-20","s"]
[null,"2023-02-21","s"]
[null,"2023-02-22","s"]
[null,"2023-02-23","s"]
[null,"2023-02-24","s"]
[null,"2023-02-25","fds"]
[null,"2023-02-26","fds"]
[null,"2023-02-27","s"]
[null,"2023-02-28","s"]
[null,"2023-03-01","s"]
[null,"2023-03-02","s"]
[null,"2023-03-03","s"]
[null,"2023-03-04","fds"]
[null,"2023-03-05","fds"]
[null,"2023-03-06","s"]
[null,"2023-03-07","s"]
[null,"2023-03-08","s"]
[null,"2023-03-09","s"]
[null,"2023-03-10","s"]
[null,"2023-03-11","fds"]
[null,"2023-03-12","fds"]
[null,"2023-03-13","s"]
[null,"2023-03-14","s"]
[null,"2023-03-15","s"]
[null,"2023-03-16","s"]
[null,"2023-03-17","s"]
[null,"2023-03-18","fds"]
[null,"2023-03-19","fds"]
[null,"2023-03-20","s"]
[null,"2023-03-21","s"]
[null,"2023-03-22","s"]
[null,"2023-03-23","s"]
[null,"2023-03-24","s"]
[null,"2023-03-25","fds"]
[null,"2023-03-26","fds"]
[null,"2023-03-27","s"]
[null,"2023-03-28","s"]
[null,"2023-03-29","s"]
[null,"2023-03-30","s"]
[null,"2023-03-31","s"]
[null,"2023-04-01","fds"]
[null,"2023-04-02","fds"]
[null,"2023-04-03","s"]
[null,"2023-04-04","s"]
[null,"2023-04-05","s"]
[null,"2023-04-06","s"]
[null,"2023-04-07","s","Oui"]
[null,"2023-04-08","fds"]
[null,"2023-04-09","fds"]
[null,"2023-04-10","s","Oui"]
[null,"2023-04-11","s"]
[null,"2023-04-12","s"]
[null,"2023-04-13","s"]
[null,"2023-04-14","s"]
[null,"2023-04-15","fds"]
[null,"2023-04-16","fds"]
[null,"2023-04-17","s"]
[null,"2023-04-18","s"]
[null,"2023-04-19","s"]
[null,"2023-04-20","s"]
[null,"2023-04-21","s"]
[null,"2023-04-22","fds"]
[null,"2023-04-23","fds"]
[null,"2023-04-24","s"]
[null,"2023-04-25","s"]
[null,"2023-04-26","s"]
[null,"2023-04-27","s"]
[null,"2023-04-28","s"]
[null,"2023-04-29","fds"]
[null,"2023-04-30","fds"]
[null,"2023-05-01","s"]
[null,"2023-05-02","s"]
[null,"2023-05-03","s"]
[null,"2023-05-04","s"]
[null,"2023-05-05","s"]
[null,"2023-05-06","fds"]
[null,"2023-05-07","fds"]
[null,"2023-05-08","s"]
[null,"2023-05-09","s"]
[null,"2023-05-10","s"]
[null,"2023-05-11","s"]
[null,"2023-05-12","s"]
[null,"2023-05-13","fds"]
[null,"2023-05-14","fds"]
[null,"2023-05-15","s"]
[null,"2023-05-16","s"]
[null,"2023-05-17","s"]
[null,"2023-05-18","s"]
[null,"2023-05-19","s"]
[null,"2023-05-20","fds"]
[null,"2023-05-21","fds"]
[null,"2023-05-22","s","Oui"]
[null,"2023-05-23","s"]
[null,"2023-05-24","s"]
[null,"2023-05-25","s"]
[null,"2023-05-26","s"]
[null,"2023-05-27","fds"]
[null,"2023-05-28","fds"]
[null,"2023-05-29","s"]
[null,"2023-05-30","s"]
[null,"2023-05-31","s"]
[null,"2023-06-01","s"]
[null,"2023-06-02","s"]
[null,"2023-06-03","fds"]
[null,"2023-06-04","fds"]
[null,"2023-06-05","s"]
[null,"2023-06-06","s"]
[null,"2023-06-07","s"]
[null,"2023-06-08","s"]
[null,"2023-06-09","s"]
[null,"2023-06-10","fds"]
[null,"2023-06-11","fds"]
[null,"2023-06-12","s"]
[null,"2023-06-13","s"]
[null,"2023-06-14","s"]
[null,"2023-06-15","s"]
[null,"2023-06-16","s"]
[null,"2023-06-17","fds"]
[null,"2023-06-18","fds"]
[null,"2023-06-19","s"]
[null,"2023-06-20","s"]
[null,"2023-06-21","s"]
[null,"2023-06-22","s"]
[null,"2023-06-23","s"]
[null,"2023-06-24","fds","Oui"]
[null,"2023-06-25","fds"]
[null,"2023-06-26","s"]
[null,"2023-06-27","s"]
[null,"2023-06-28","s"]
[null,"2023-06-29","s"]
[null,"2023-06-30","s"]
[null,"2023-07-01","fds","Oui"]
[null,"2023-07-02","fds"]
[null,"2023-07-03","s"]
[null,"2023-07-04","s"]
[null,"2023-07-05","s"]
[null,"2023-07-06","s"]
[null,"2023-07-07","s"]
[null,"2023-07-08","fds"]
[null,"2023-07-09","fds"]
[null,"2023-07-10","s"]
[null,"2023-07-11","s"]
[null,"2023-07-12","s"]
[null,"2023-07-13","s"]
[null,"2023-07-14","s"]
[null,"2023-07-15","fds"]
[null,"2023-07-16","fds"]
[null,"2023-07-17","s"]
[null,"2023-07-18","s"]
[null,"2023-07-19","s"]
[null,"2023-07-20","s"]
[null,"2023-07-21","s"]
[null,"2023-07-22","fds"]
[null,"2023-07-23","fds"]
[null,"2023-07-24","s"]
[null,"2023-07-25","s"]
[null,"2023-07-26","s"]
[null,"2023-07-27","s"]
[null,"2023-07-28","s"]
[null,"2023-07-29","fds"]
[null,"2023-07-30","fds"]
[null,"2023-07-31","s"]
[null,"2023-08-01","s"]
[null,"2023-08-02","s"]
[null,"2023-08-03","s"]
[null,"2023-08-04","s"]
[null,"2023-08-05","fds"]
[null,"2023-08-06","fds"]
[null,"2023-08-07","s"]
[null,"2023-08-08","s"]
[null,"2023-08-09","s"]
[null,"2023-08-10","s"]
[null,"2023-08-11","s"]
[null,"2023-08-12","fds"]
[null,"2023-08-13","fds"]
[null,"2023-08-14","s"]
[null,"2023-08-15","s"]
[null,"2023-08-16","s"]
[null,"2023-08-17","s"]
[null,"2023-08-18","s"]
[null,"2023-08-19","fds"]
[null,"2023-08-20","fds"]
[null,"2023-08-21","s"]
[null,"2023-08-22","s"]
[null,"2023-08-23","s"]
[null,"2023-08-24","s"]
[null,"2023-08-25","s"]
[null,"2023-08-26","fds"]
[null,"2023-08-27","fds"]
[null,"2023-08-28","s"]
[null,"2023-08-29","s"]
[null,"2023-08-30","s"]
[null,"2023-08-31","s"]
[null,"2023-09-01","s"]
[null,"2023-09-02","fds"]
[null,"2023-09-03","fds"]
[null,"2023-09-04","s","Oui"]
[null,"2023-09-05","s"]
[null,"2023-09-06","s"]
[null,"2023-09-07","s"]
[null,"2023-09-08","s"]
[null,"2023-09-09","fds"]
[null,"2023-09-10","fds"]
[null,"2023-09-11","s"]
[null,"2023-09-12","s"]
[null,"2023-09-13","s"]
[null,"2023-09-14","s"]
[null,"2023-09-15","s"]
[null,"2023-09-16","fds"]
[null,"2023-09-17","fds"]
[null,"2023-09-18","s"]
[null,"2023-09-19","s"]
[null,"2023-09-20","s"]
[null,"2023-09-21","s"]
[null,"2023-09-22","s"]
[null,"2023-09-23","fds"]
[null,"2023-09-24","fds"]
[null,"2023-09-25","s"]
[null,"2023-09-26","s"]
[null,"2023-09-27","s"]
[null,"2023-09-28","s"]
[null,"2023-09-29","s"]
[null,"2023-09-30","fds"]
[null,"2023-10-01","fds"]
[null,"2023-10-02","s"]
[null,"2023-10-03","s"]
[null,"2023-10-04","s"]
[null,"2023-10-05","s"]
[null,"2023-10-06","s"]
[null,"2023-10-07","fds"]
[null,"2023-10-08","fds"]
[null,"2023-10-09","s","Oui"]
[null,"2023-10-10","s"]
[null,"2023-10-11","s"]
[null,"2023-10-12","s"]
[null,"2023-10-13","s"]
[null,"2023-10-14","fds"]
[null,"2023-10-15","fds"]
[null,"2023-10-16","s"]
[null,"2023-10-17","s"]
[null,"2023-10-18","s"]
[null,"2023-10-19","s"]
[null,"2023-10-20","s"]
[null,"2023-10-21","fds"]
[null,"2023-10-22","fds"]
[null,"2023-10-23","s"]
[null,"2023-10-24","s"]
[null,"2023-10-25","s"]
[null,"2023-10-26","s"]
[null,"2023-10-27","s"]
[null,"2023-10-28","fds"]
[null,"2023-10-29","fds"]
[null,"2023-10-30","s"]
[null,"2023-10-31","s"]
[null,"2023-11-01","s"]
[null,"2023-11-02","s"]
[null,"2023-11-03","s"]
[null,"2023-11-04","fds"]
[null,"2023-11-05","fds"]
[null,"2023-11-06","s"]
[null,"2023-11-07","s"]
[null,"2023-11-08","s"]
[null,"2023-11-09","s"]
[null,"2023-11-10","s"]
[null,"2023-11-11","fds"]
[null,"2023-11-12","fds"]
[null,"2023-11-13","s"]
[null,"2023-11-14","s"]
[null,"2023-11-15","s"]
[null,"2023-11-16","s"]
[null,"2023-11-17","s"]
[null,"2023-11-18","fds"]
[null,"2023-11-19","fds"]
[null,"2023-11-20","s"]
[null,"2023-11-21","s"]
[null,"2023-11-22","s"]
[null,"2023-11-23","s"]
[null,"2023-11-24","s"]
[null,"2023-11-25","fds"]
[null,"2023-11-26","fds"]
[null,"2023-11-27","s"]
[null,"2023-11-28","s"]
[null,"2023-11-29","s"]
[null,"2023-11-30","s"]
[null,"2023-12-01","s"]
[null,"2023-12-02","fds"]
[null,"2023-12-03","fds"]
[null,"2023-12-04","s"]
[null,"2023-12-05","s"]
[null,"2023-12-06","s"]
[null,"2023-12-07","s"]
[null,"2023-12-08","s"]
[null,"2023-12-09","fds"]
[null,"2023-12-10","fds"]
[null,"2023-12-11","s"]
[null,"2023-12-12","s"]
[null,"2023-12-13","s"]
[null,"2023-12-14","s"]
[null,"2023-12-15","s"]
[null,"2023-12-16","fds"]
[null,"2023-12-17","fds"]
[null,"2023-12-18","s"]
[null,"2023-12-19","s"]
[null,"2023-12-20","s"]
[null,"2023-12-21","s"]
[null,"2023-12-22","s"]
[null,"2023-12-23","fds"]
[null,"2023-12-24","fds","Oui"]
[null,"2023-12-25","s","Oui"]
[null,"2023-12-26","s","Oui"]
[null,"2023-12-27","s"]
[null,"2023-12-28","s"]
[null,"2023-12-29","s"]
[null,"2023-12-30","fds"]
[null,"2023-12-31","fds","Oui"]
[null,"2024-01-01","s","Oui"]
[null,"2024-01-02","s","Oui"]
[null,"2024-01-03","s"]
[null,"2024-01-04","s"]
[null,"2024-01-05","s"]
[null,"2024-01-06","fds"]
[null,"2024-01-07","fds"]
[null,"2024-01-08","s"]
[null,"2024-01-09","s"]
[null,"2024-01-10","s"]
[null,"2024-01-11","s"]
[null,"2024-01-12","s"]
[null,"2024-01-13","fds"]
[null,"2024-01-14","fds"]
[null,"2024-01-15","s"]
[null,"2024-01-16","s"]
[null,"2024-01-17","s"]
[null,"2024-01-18","s"]
[null,"2024-01-19","s"]
[null,"2024-01-20","fds"]
[null,"2024-01-21","fds"]
[null,"2024-01-22","s"]
[null,"2024-01-23","s"]
[null,"2024-01-24","s"]
[null,"2024-01-25","s"]
[null,"2024-01-26","s"]
[null,"2024-01-27","fds"]
[null,"2024-01-28","fds"]
[null,"2024-01-29","s"]
[null,"2024-01-30","s"]
[null,"2024-01-31","s"]
[null,"2024-02-01","s"]
[null,"2024-02-02","s"]
[null,"2024-02-03","fds"]
[null,"2024-02-04","fds"]
[null,"2024-02-05","s"]
[null,"2024-02-06","s"]
[null,"2024-02-07","s"]
[null,"2024-02-08","s"]
[null,"2024-02-09","s"]
[null,"2024-02-10","fds"]
[null,"2024-02-11","fds"]
[null,"2024-02-12","s"]
[null,"2024-02-13","s"]
[null,"2024-02-14","s"]
[null,"2024-02-15","s"]
[null,"2024-02-16","s"]
[null,"2024-02-17","fds"]
[null,"2024-02-18","fds"]
[null,"2024-02-19","s"]
[null,"2024-02-20","s"]
[null,"2024-02-21","s"]
[null,"2024-02-22","s"]
[null,"2024-02-23","s"]
[null,"2024-02-24","fds"]
[null,"2024-02-25","fds"]
[null,"2024-02-26","s"]
[null,"2024-02-27","s"]
[null,"2024-02-28","s"]
[null,"2024-02-29","s"]
[null,"2024-03-01","s"]
[null,"2024-03-02","fds"]
[null,"2024-03-03","fds"]
[null,"2024-03-04","s"]
[null,"2024-03-05","s"]
[null,"2024-03-06","s"]
[null,"2024-03-07","s"]
[null,"2024-03-08","s"]
[null,"2024-03-09","fds"]
[null,"2024-03-10","fds"]
[null,"2024-03-11","s"]
[null,"2024-03-12","s"]
[null,"2024-03-13","s"]
[null,"2024-03-14","s"]
[null,"2024-03-15","s"]
[null,"2024-03-16","fds"]
[null,"2024-03-17","fds"]
[null,"2024-03-18","s"]
[null,"2024-03-19","s"]
[null,"2024-03-20","s"]
[null,"2024-03-21","s"]
[null,"2024-03-22","s"]
[null,"2024-03-23","fds"]
[null,"2024-03-24","fds"]
[null,"2024-03-25","s"]
[null,"2024-03-26","s"]
[null,"2024-03-27","s"]
[null,"2024-03-28","s"]
[null,"2024-03-29","s","oui"]
[null,"2024-03-30","fds"]
[null,"2024-03-31","fds"]
[null,"2024-04-01","s","Oui"]
[null,"2024-04-02","s"]
[null,"2024-04-03","s"]
[null,"2024-04-04","s"]
[null,"2024-04-05","s"]
[null,"2024-04-06","fds"]
[null,"2024-04-07","fds"]
[null,"2024-04-08","s"]
[null,"2024-04-09","s"]
[null,"2024-04-10","s"]
[null,"2024-04-11","s"]
[null,"2024-04-12","s"]
[null,"2024-04-13","fds"]
[null,"2024-04-14","fds"]
[null,"2024-04-15","s"]
[null,"2024-04-16","s"]
[null,"2024-04-17","s"]
[null,"2024-04-18","s"]
[null,"2024-04-19","s"]
[null,"2024-04-20","fds"]
[null,"2024-04-21","fds"]
[null,"2024-04-22","s"]
[null,"2024-04-23","s"]
[null,"2024-04-24","s"]
[null,"2024-04-25","s"]
[null,"2024-04-26","s"]
[null,"2024-04-27","fds"]
[null,"2024-04-28","fds"]
[null,"2024-04-29","s"]
[null,"2024-04-30","s"]
[null,"2024-05-01","s"]
[null,"2024-05-02","s"]
[null,"2024-05-03","s"]
[null,"2024-05-04","fds"]
[null,"2024-05-05","fds"]
[null,"2024-05-06","s"]
[null,"2024-05-07","s"]
[null,"2024-05-08","s"]
[null,"2024-05-09","s"]
[null,"2024-05-10","s"]
[null,"2024-05-11","fds"]
[null,"2024-05-12","fds"]
[null,"2024-05-13","s"]
[null,"2024-05-14","s"]
[null,"2024-05-15","s"]
[null,"2024-05-16","s"]
[null,"2024-05-17","s"]
[null,"2024-05-18","fds"]
[null,"2024-05-19","fds"]
[null,"2024-05-20","s","Oui"]
[null,"2024-05-21","s"]
[null,"2024-05-22","s"]
[null,"2024-05-23","s"]
[null,"2024-05-24","s"]
[null,"2024-05-25","fds"]
[null,"2024-05-26","fds"]
[null,"2024-05-27","s"]
[null,"2024-05-28","s"]
[null,"2024-05-29","s"]
[null,"2024-05-30","s"]
[null,"2024-05-31","s"]
[null,"2024-06-01","fds"]
[null,"2024-06-02","fds"]
[null,"2024-06-03","s"]
[null,"2024-06-04","s"]
[null,"2024-06-05","s"]
[null,"2024-06-06","s"]
[null,"2024-06-07","s"]
[null,"2024-06-08","fds"]
[null,"2024-06-09","fds"]
[null,"2024-06-10","s"]
[null,"2024-06-11","s"]
[null,"2024-06-12","s"]
[null,"2024-06-13","s"]
[null,"2024-06-14","s"]
[null,"2024-06-15","fds"]
[null,"2024-06-16","fds"]
[null,"2024-06-17","s"]
[null,"2024-06-18","s"]
[null,"2024-06-19","s"]
[null,"2024-06-20","s"]
[null,"2024-06-21","s"]
[null,"2024-06-22","fds"]
[null,"2024-06-23","fds"]
[null,"2024-06-24","s","Oui"]
[null,"2024-06-25","s"]
[null,"2024-06-26","s"]
[null,"2024-06-27","s"]
[null,"2024-06-28","s"]
[null,"2024-06-29","fds"]
[null,"2024-06-30","fds"]
[null,"2024-07-01","s","Oui"]
[null,"2024-07-02","s"]
[null,"2024-07-03","s"]
[null,"2024-07-04","s"]
[null,"2024-07-05","s"]
[null,"2024-07-06","fds"]
[null,"2024-07-07","fds"]
[null,"2024-07-08","s"]
[null,"2024-07-09","s"]
[null,"2024-07-10","s"]
[null,"2024-07-11","s"]
[null,"2024-07-12","s"]
[null,"2024-07-13","fds"]
[null,"2024-07-14","fds"]
[null,"2024-07-15","s"]
[null,"2024-07-16","s"]
[null,"2024-07-17","s"]
[null,"2024-07-18","s"]
[null,"2024-07-19","s"]
[null,"2024-07-20","fds"]
[null,"2024-07-21","fds"]
[null,"2024-07-22","s"]
[null,"2024-07-23","s"]
[null,"2024-07-24","s"]
[null,"2024-07-25","s"]
[null,"2024-07-26","s"]
[null,"2024-07-27","fds"]
[null,"2024-07-28","fds"]
[null,"2024-07-29","s"]
[null,"2024-07-30","s"]
[null,"2024-07-31","s"]
[null,"2024-08-01","s"]
[null,"2024-08-02","s"]
[null,"2024-08-03","fds"]
[null,"2024-08-04","fds"]
[null,"2024-08-05","s"]
[null,"2024-08-06","s"]
[null,"2024-08-07","s"]
[null,"2024-08-08","s"]
[null,"2024-08-09","s"]
[null,"2024-08-10","fds"]
[null,"2024-08-11","fds"]
[null,"2024-08-12","s"]
[null,"2024-08-13","s"]
[null,"2024-08-14","s"]
[null,"2024-08-15","s"]
[null,"2024-08-16","s"]
[null,"2024-08-17","fds"]
[null,"2024-08-18","fds"]
[null,"2024-08-19","s"]
[null,"2024-08-20","s"]
[null,"2024-08-21","s"]
[null,"2024-08-22","s"]
[null,"2024-08-23","s"]
[null,"2024-08-24","fds"]
[null,"2024-08-25","fds"]
[null,"2024-08-26","s"]
[null,"2024-08-27","s"]
[null,"2024-08-28","s"]
[null,"2024-08-29","s"]
[null,"2024-08-30","s"]
[null,"2024-08-31","fds"]
[null,"2024-09-01","fds"]
[null,"2024-09-02","s","Oui"]
[null,"2024-09-03","s"]
[null,"2024-09-04","s"]
[null,"2024-09-05","s"]
[null,"2024-09-06","s"]
[null,"2024-09-07","fds"]
[null,"2024-09-08","fds"]
[null,"2024-09-09","s"]
[null,"2024-09-10","s"]
[null,"2024-09-11","s"]
[null,"2024-09-12","s"]
[null,"2024-09-13","s"]
[null,"2024-09-14","fds"]
[null,"2024-09-15","fds"]
[null,"2024-09-16","s"]
[null,"2024-09-17","s"]
[null,"2024-09-18","s"]
[null,"2024-09-19","s"]
[null,"2024-09-20","s"]
[null,"2024-09-21","fds"]
[null,"2024-09-22","fds"]
[null,"2024-09-23","s"]
[null,"2024-09-24","s"]
[null,"2024-09-25","s"]
[null,"2024-09-26","s"]
[null,"2024-09-27","s"]
[null,"2024-09-28","fds"]
[null,"2024-09-29","fds"]
[null,"2024-09-30","s"]
[null,"2024-10-01","s"]
[null,"2024-10-02","s"]
[null,"2024-10-03","s"]
[null,"2024-10-04","s"]
[null,"2024-10-05","fds"]
[null,"2024-10-06","fds"]
[null,"2024-10-07","s"]
[null,"2024-10-08","s"]
[null,"2024-10-09","s"]
[null,"2024-10-10","s"]
[null,"2024-10-11","s"]
[null,"2024-10-12","fds"]
[null,"2024-10-13","fds"]
[null,"2024-10-14","s","Oui"]
[null,"2024-10-15","s"]
[null,"2024-10-16","s"]
[null,"2024-10-17","s"]
[null,"2024-10-18","s"]
[null,"2024-10-19","fds"]
[null,"2024-10-20","fds"]
[null,"2024-10-21","s"]
[null,"2024-10-22","s"]
[null,"2024-10-23","s"]
[null,"2024-10-24","s"]
[null,"2024-10-25","s"]
[null,"2024-10-26","fds"]
[null,"2024-10-27","fds"]
[null,"2024-10-28","s"]
[null,"2024-10-29","s"]
[null,"2024-10-30","s"]
[null,"2024-10-31","s"]
[null,"2024-11-01","s"]
[null,"2024-11-02","fds"]
[null,"2024-11-03","fds"]
[null,"2024-11-04","s"]
[null,"2024-11-05","s"]
[null,"2024-11-06","s"]
[null,"2024-11-07","s"]
[null,"2024-11-08","s"]
[null,"2024-11-09","fds"]
[null,"2024-11-10","fds"]
[null,"2024-11-11","s"]
[null,"2024-11-12","s"]
[null,"2024-11-13","s"]
[null,"2024-11-14","s"]
[null,"2024-11-15","s"]
[null,"2024-11-16","fds"]
[null,"2024-11-17","fds"]
[null,"2024-11-18","s"]
[null,"2024-11-19","s"]
[null,"2024-11-20","s"]
[null,"2024-11-21","s"]
[null,"2024-11-22","s"]
[null,"2024-11-23","fds"]
[null,"2024-11-24","fds"]
[null,"2024-11-25","s"]
[null,"2024-11-26","s"]
[null,"2024-11-27","s"]
[null,"2024-11-28","s"]
[null,"2024-11-29","s"]
[null,"2024-11-30","fds"]
[null,"2024-12-01","fds"]
[null,"2024-12-02","s"]
[null,"2024-12-03","s"]
[null,"2024-12-04","s"]
[null,"2024-12-05","s"]
[null,"2024-12-06","s"]
[null,"2024-12-07","fds"]
[null,"2024-12-08","fds"]
[null,"2024-12-09","s"]
[null,"2024-12-10","s"]
[null,"2024-12-11","s"]
[null,"2024-12-12","s"]
[null,"2024-12-13","s"]
[null,"2024-12-14","fds"]
[null,"2024-12-15","fds"]
[null,"2024-12-16","s"]
[null,"2024-12-17","s"]
[null,"2024-12-18","s"]
[null,"2024-12-19","s"]
[null,"2024-12-20","s"]
[null,"2024-12-21","fds"]
[null,"2024-12-22","fds"]
[null,"2024-12-23","s"]
[null,"2024-12-24","s","oui"]
[null,"2024-12-25","s","oui"]
[null,"2024-12-26","s","oui"]
[null,"2024-12-27","s"]
[null,"2024-12-28","fds"]
[null,"2024-12-29","fds"]
[null,"2024-12-30","s"]
[null,"2024-12-31","s","oui"]
[null,"2025-01-01","s","oui"]
[null,"2025-01-02","s","oui"]
[null,"2025-01-03","s"]
[null,"2025-01-04","fds"]
[null,"2025-01-05","fds"]
[null,"2025-01-06","s"]
[null,"2025-01-07","s"]
[null,"2025-01-08","s"]
[null,"2025-01-09","s"]
[null,"2025-01-10","s"]
[null,"2025-01-11","fds"]
[null,"2025-01-12","fds"]
[null,"2025-01-13","s"]
[null,"2025-01-14","s"]
[null,"2025-01-15","s"]
[null,"2025-01-16","s"]
[null,"2025-01-17","s"]
[null,"2025-01-18","fds"]
[null,"2025-01-19","fds"]
[null,"2025-01-20","s"]
[null,"2025-01-21","s"]
[null,"2025-01-22","s"]
[null,"2025-01-23","s"]
[null,"2025-01-24","s"]
[null,"2025-01-25","fds"]
[null,"2025-01-26","fds"]
[null,"2025-01-27","s"]
[null,"2025-01-28","s"]
[null,"2025-01-29","s"]
[null,"2025-01-30","s"]
[null,"2025-01-31","s"]
[null,"2025-02-01","fds"]
[null,"2025-02-02","fds"]
[null,"2025-02-03","s"]
[null,"2025-02-04","s"]
[null,"2025-02-05","s"]
[null,"2025-02-06","s"]
[null,"2025-02-07","s"]
[null,"2025-02-08","fds"]
[null,"2025-02-09","fds"]
[null,"2025-02-10","s"]
[null,"2025-02-11","s"]
[null,"2025-02-12","s"]
[null,"2025-02-13","s"]
[null,"2025-02-14","s"]
[null,"2025-02-15","fds"]
[null,"2025-02-16","fds"]
[null,"2025-02-17","s"]
[null,"2025-02-18","s"]
[null,"2025-02-19","s"]
[null,"2025-02-20","s"]
[null,"2025-02-21","s"]
[null,"2025-02-22","fds"]
[null,"2025-02-23","fds"]
[null,"2025-02-24","s"]
[null,"2025-02-25","s"]
[null,"2025-02-26","s"]
[null,"2025-02-27","s"]
[null,"2025-02-28","s"]
[null,"2025-03-01","fds"]
[null,"2025-03-02","fds"]
[null,"2025-03-03","s"]
[null,"2025-03-04","s"]
[null,"2025-03-05","s"]
[null,"2025-03-06","s"]
[null,"2025-03-07","s"]
[null,"2025-03-08","fds"]
[null,"2025-03-09","fds"]
[null,"2025-03-10","s"]
[null,"2025-03-11","s"]
[null,"2025-03-12","s"]
[null,"2025-03-13","s"]
[null,"2025-03-14","s"]
[null,"2025-03-15","fds"]
[null,"2025-03-16","fds"]
[null,"2025-03-17","s"]
[null,"2025-03-18","s"]
[null,"2025-03-19","s"]
[null,"2025-03-20","s"]
[null,"2025-03-21","s"]
[null,"2025-03-22","fds"]
[null,"2025-03-23","fds"]
[null,"2025-03-24","s"]
[null,"2025-03-25","s"]
[null,"2025-03-26","s"]
[null,"2025-03-27","s"]
[null,"2025-03-28","s"]
[null,"2025-03-29","fds"]
[null,"2025-03-30","fds"]
[null,"2025-03-31","s"]
[null,"2025-04-01","s"]
[null,"2025-04-02","s"]
[null,"2025-04-03","s"]
[null,"2025-04-04","s"]
[null,"2025-04-05","fds"]
[null,"2025-04-06","fds"]
[null,"2025-04-07","s"]
[null,"2025-04-08","s"]
[null,"2025-04-09","s"]
[null,"2025-04-10","s"]
[null,"2025-04-11","s"]
[null,"2025-04-12","fds"]
[null,"2025-04-13","fds"]
[null,"2025-04-14","s"]
[null,"2025-04-15","s"]
[null,"2025-04-16","s"]
[null,"2025-04-17","s"]
[null,"2025-04-18","s","oui"]
[null,"2025-04-19","fds"]
[null,"2025-04-20","fds"]
[null,"2025-04-21","s","oui"]
[null,"2025-04-22","s"]
[null,"2025-04-23","s"]
[null,"2025-04-24","s"]
[null,"2025-04-25","s"]
[null,"2025-04-26","fds"]
[null,"2025-04-27","fds"]
[null,"2025-04-28","s"]
[null,"2025-04-29","s"]
[null,"2025-04-30","s"]
[null,"2025-05-01","s"]
[null,"2025-05-02","s"]
[null,"2025-05-03","fds"]
[null,"2025-05-04","fds"]
[null,"2025-05-05","s"]
[null,"2025-05-06","s"]
[null,"2025-05-07","s"]
[null,"2025-05-08","s"]
[null,"2025-05-09","s"]
[null,"2025-05-10","fds"]
[null,"2025-05-11","fds"]
[null,"2025-05-12","s"]
[null,"2025-05-13","s"]
[null,"2025-05-14","s"]
[null,"2025-05-15","s"]
[null,"2025-05-16","s"]
[null,"2025-05-17","fds"]
[null,"2025-05-18","fds"]
[null,"2025-05-19","s","oui"]
[null,"2025-05-20","s"]
[null,"2025-05-21","s"]
[null,"2025-05-22","s"]
[null,"2025-05-23","s"]
[null,"2025-05-24","fds"]
[null,"2025-05-25","fds"]
[null,"2025-05-26","s"]
[null,"2025-05-27","s"]
[null,"2025-05-28","s"]
[null,"2025-05-29","s"]
[null,"2025-05-30","s"]
[null,"2025-05-31","fds"]
[null,"2025-06-01","fds"]
[null,"2025-06-02","s"]
[null,"2025-06-03","s"]
[null,"2025-06-04","s"]
[null,"2025-06-05","s"]
[null,"2025-06-06","s"]
[null,"2025-06-07","fds"]
[null,"2025-06-08","fds"]
[null,"2025-06-09","s"]
[null,"2025-06-10","s"]
[null,"2025-06-11","s"]
[null,"2025-06-12","s"]
[null,"2025-06-13","s"]
[null,"2025-06-14","fds"]
[null,"2025-06-15","fds"]
[null,"2025-06-16","s"]
[null,"2025-06-17","s"]
[null,"2025-06-18","s"]
[null,"2025-06-19","s"]
[null,"2025-06-20","s"]
[null,"2025-06-21","fds"]
[null,"2025-06-22","fds"]
[null,"2025-06-23","s"]
[null,"2025-06-24","s","oui"]
[null,"2025-06-25","s"]
[null,"2025-06-26","s"]
[null,"2025-06-27","s"]
[null,"2025-06-28","fds"]
[null,"2025-06-29","fds"]
[null,"2025-06-30","s"]
[null,"2025-07-01","s","oui"]
[null,"2025-07-02","s"]
[null,"2025-07-03","s"]
[null,"2025-07-04","s"]
[null,"2025-07-05","fds"]
[null,"2025-07-06","fds"]
[null,"2025-07-07","s"]
[null,"2025-07-08","s"]
[null,"2025-07-09","s"]
[null,"2025-07-10","s"]
[null,"2025-07-11","s"]
[null,"2025-07-12","fds"]
[null,"2025-07-13","fds"]
[null,"2025-07-14","s"]
[null,"2025-07-15","s"]
[null,"2025-07-16","s"]
[null,"2025-07-17","s"]
[null,"2025-07-18","s"]
[null,"2025-07-19","fds"]
[null,"2025-07-20","fds"]
[null,"2025-07-21","s"]
[null,"2025-07-22","s"]
[null,"2025-07-23","s"]
[null,"2025-07-24","s"]
[null,"2025-07-25","s"]
[null,"2025-07-26","fds"]
[null,"2025-07-27","fds"]
[null,"2025-07-28","s"]
[null,"2025-07-29","s"]
[null,"2025-07-30","s"]
[null,"2025-07-31","s"]
[null,"2025-08-01","s"]
[null,"2025-08-02","fds"]
[null,"2025-08-03","fds"]
[null,"2025-08-04","s"]
[null,"2025-08-05","s"]
[null,"2025-08-06","s"]
[null,"2025-08-07","s"]
[null,"2025-08-08","s"]
[null,"2025-08-09","fds"]
[null,"2025-08-10","fds"]
[null,"2025-08-11","s"]
[null,"2025-08-12","s"]
[null,"2025-08-13","s"]
[null,"2025-08-14","s"]
[null,"2025-08-15","s"]
[null,"2025-08-16","fds"]
[null,"2025-08-17","fds"]
[null,"2025-08-18","s"]
[null,"2025-08-19","s"]
[null,"2025-08-20","s"]
[null,"2025-08-21","s"]
[null,"2025-08-22","s"]
[null,"2025-08-23","fds"]
[null,"2025-08-24","fds"]
[null,"2025-08-25","s"]
[null,"2025-08-26","s"]
[null,"2025-08-27","s"]
[null,"2025-08-28","s"]
[null,"2025-08-29","s"]
[null,"2025-08-30","fds"]
[null,"2025-08-31","fds"]
[null,"2025-09-01","s","oui"]
[null,"2025-09-02","s"]
[null,"2025-09-03","s"]
[null,"2025-09-04","s"]
[null,"2025-09-05","s"]
[null,"2025-09-06","fds"]
[null,"2025-09-07","fds"]
[null,"2025-09-08","s"]
[null,"2025-09-09","s"]
[null,"2025-09-10","s"]
[null,"2025-09-11","s"]
[null,"2025-09-12","s"]
[null,"2025-09-13","fds"]
[null,"2025-09-14","fds"]
[null,"2025-09-15","s"]
[null,"2025-09-16","s"]
[null,"2025-09-17","s"]
[null,"2025-09-18","s"]
[null,"2025-09-19","s"]
[null,"2025-09-20","fds"]
[null,"2025-09-21","fds"]
[null,"2025-09-22","s"]
[null,"2025-09-23","s"]
[null,"2025-09-24","s"]
[null,"2025-09-25","s"]
[null,"2025-09-26","s"]
[null,"2025-09-27","fds"]
[null,"2025-09-28","fds"]
[null,"2025-09-29","s"]
[null,"2025-09-30","s"]
[null,"2025-10-01","s"]
[null,"2025-10-02","s"]
[null,"2025-10-03","s"]
[null,"2025-10-04","fds"]
[null,"2025-10-05","fds"]
[null,"2025-10-06","s"]
[null,"2025-10-07","s"]
[null,"2025-10-08","s"]
[null,"2025-10-09","s"]
[null,"2025-10-10","s"]
[null,"2025-10-11","fds"]
[null,"2025-10-12","fds"]
[null,"2025-10-13","s","oui"]
[null,"2025-10-14","s"]
[null,"2025-10-15","s"]
[null,"2025-10-16","s"]
[null,"2025-10-17","s"]
[null,"2025-10-18","fds"]
[null,"2025-10-19","fds"]
[null,"2025-10-20","s"]
[null,"2025-10-21","s"]
[null,"2025-10-22","s"]
[null,"2025-10-23","s"]
[null,"2025-10-24","s"]
[null,"2025-10-25","fds"]
[null,"2025-10-26","fds"]
[null,"2025-10-27","s"]
[null,"2025-10-28","s"]
[null,"2025-10-29","s"]
[null,"2025-10-30","s"]
[null,"2025-10-31","s"]
[null,"2025-11-01","fds"]
[null,"2025-11-02","fds"]
[null,"2025-11-03","s"]
[null,"2025-11-04","s"]
[null,"2025-11-05","s"]
[null,"2025-11-06","s"]
[null,"2025-11-07","s"]
[null,"2025-11-08","fds"]
[null,"2025-11-09","fds"]
[null,"2025-11-10","s"]
[null,"2025-11-11","s"]
[null,"2025-11-12","s"]
[null,"2025-11-13","s"]
[null,"2025-11-14","s"]
[null,"2025-11-15","fds"]
[null,"2025-11-16","fds"]
[null,"2025-11-17","s"]
[null,"2025-11-18","s"]
[null,"2025-11-19","s"]
[null,"2025-11-20","s"]
[null,"2025-11-21","s"]
[null,"2025-11-22","fds"]
[null,"2025-11-23","fds"]
[null,"2025-11-24","s"]
[null,"2025-11-25","s"]
[null,"2025-11-26","s"]
[null,"2025-11-27","s"]
[null,"2025-11-28","s"]
[null,"2025-11-29","fds"]
[null,"2025-11-30","fds"]
[null,"2025-12-01","s"]
[null,"2025-12-02","s"]
[null,"2025-12-03","s"]
[null,"2025-12-04","s"]
[null,"2025-12-05","s"]
[null,"2025-12-06","fds"]
[null,"2025-12-07","fds"]
[null,"2025-12-08","s"]
[null,"2025-12-09","s"]
[null,"2025-12-10","s"]
[null,"2025-12-11","s"]
[null,"2025-12-12","s"]
[null,"2025-12-13","fds"]
[null,"2025-12-14","fds"]
[null,"2025-12-15","s"]
[null,"2025-12-16","s"]
[null,"2025-12-17","s"]
[null,"2025-12-18","s"]
[null,"2025-12-19","s"]
[null,"2025-12-20","fds"]
[null,"2025-12-21","fds"]
[null,"2025-12-22","s"]
[null,"2025-12-23","s"]
[null,"2025-12-24","s","oui"]
[null,"2025-12-25","s","oui"]
[null,"2025-12-26","s","oui"]
[null,"2025-12-27","fds"]
[null,"2025-12-28","fds"]
[null,"2025-12-29","s"]
[null,"2025-12-30","s"]
[null,"2025-12-31","s","oui"]

{"sheet":"TAUX","index":16,"n_rows":81,"n_cols":8,"rows_kept":81,"cut":false,"hidden":true,"merged":[[46,2,46,3],[45,6,45,7],[46,6,46,7]]}
[]
[null,"champs à modifier avec les nouveaux tarifs",2025]
[]
[null,"Attente"]
[]
[null,"Semaine - jour/soir  ",28.75]
[null,"Semaine - nuit  ",35.5]
[null,"Fin semaine - jour/soir  ",31.75]
[null,"Fin semaine - nuit  ",38.5]
[null,"Fériés - jour/soir  ",40]
[null,"Fériés - nuit  ",48]
[]
[null,"Base ailleurs qu'à Québec et Montréal"]
[]
[null,"Semaine - jour/soir  ",135]
[null,"Semaine - nuit  ",167]
[null,"Fin semaine - jour/soir  ",150]
[null,"Fin semaine - nuit  ",184]
[null,"Fériés - jour/soir  ",192]
[null,"Fériés - nuit  ",233]
[]
[null,"Base Montréal et Québec"]
[]
[null,"Semaine - jour/soir  ",180]
[null,"Semaine - nuit  ",216]
[null,"Fin semaine - jour/soir  ",194]
[null,"Fin semaine - nuit  ",237]
[null,"Fériés - jour/soir  ",239]
[null,"Fériés - nuit  ",282]
[]
[null,"Kilométrage"]
[null,"Chemin public",1.75]
[null,"Chemin non public",3.2]
[]
[null,"Divers frais"]
[null,"Frais de garde",65.75]
[null,"Frais de visite",65.75]
[null,"Nettoyage supplémentaire",44.75]
[null,"Corps additionnel",122]
[]
[null,"Repas","Maximum","incluant le pourboire",null,"Maximum sans les taxes"]
[null,"Déjeuner",14.7,null,null,12.75]
[null,"Dîner",20.2,null,null,17.55]
[null,"Souper",30.5,null,null,26.5]
[]
[null,null,null,null,null,null,"Indemnité journalière"]
[null,null,"Tarifs = indemnités journalières",null,null,null,0.5]
[null,"Nuitées","Basse","Haute",null,null,"Basse","Haute"]
[null,null,"basse saison","haute saison",null,null,"basse saison","haute saison"]
[null,"Montréal",218,234,null,"Montréal",{"$f":"ROUND(C50/2,0)","v":109},{"$f":"ROUND(D50/2,0)","v":117}]
[null,"Québec",192,192,null,"Québec",96,96]
[null,"Laval",187,197,null,"Laval",94,99]
[null,"Gatineau",187,197,null,"Gatineau",94,99]
[null,"Longueuil",187,197,null,"Longueuil",94,99]
[null,"Lac-Beauport",187,197,null,"Lac-Beauport",94,99]
[null,"Lac-Delage",187,197,null,"Lac-Delage",94,99]
[null,"Rimouski",163,168,null,"Rimouski",82,84]
[null,"Ailleurs",163,168,null,"Ailleurs",{"$f":"ROUND(C58/2,0)","v":82},{"$f":"ROUND(D58/2,0)","v":84}]
[null,null,"Tarifs excluant la taxe sur l'hébergement"]
[]
[null,"TPS",{"$f":"ROUND(D61,5)","v":0.05},0.05]
[null,"TVQ",{"$f":"ROUND(D62,5)","v":9.9750000000000005E-2},9.9750000000000005E-2]
[null,"total à titre indicatif seulement",{"$f":"SUM(C61:C62)","v":0.14974999999999999},{"$f":"D61+D62","v":0.14974999999999999}]
[]
[]
[null,"Lieux de transport"]
[null,null,"Installations du transporteur"]
[null,null,"Morgue Montréal"]
[null,null,"Morgue Québec"]
[null,null,"Hôpital"]
[null,null,"Résidence privée"]
[null,null,"CHSLD / centre jeunesse"]
[null,null,"Prison / pénitencier"]
[null,null,"Autre"]
[]
[]
[]
[null,"Liste pour stationnement"]
[null,null,"oui"]
[null,null,"non"]
[null,null,"ne sait pas"]

{"sheet":"Calculs repas","index":17,"n_rows":24,"n_cols":8,"rows_kept":24,"cut":false,"hidden":true,"merged":[]}
[]
[null,null,null,null,"REPAS"]
[]
[]
[null,null,null,"Déjeuner",null,"Dîner",null,"Souper"]
[]
[null,null,null,{"$f":"TAUX!F42","v":12.75},null,{"$f":"TAUX!F43","v":17.55},null,{"$f":"TAUX!F44","v":26.5}]
[null,"TPS",{"$f":"ROUND(D7*TAUX!$C$61,2)","v":0.64},null,{"$f":"F7*TAUX!$C$61","v":0.87750000000000006},null,{"$f":"ROUND(H7*TAUX!$C$61,3)","v":1.325}]
[null,"TVQ",{"$f":"ROUND(D7*TAUX!$C$62,2)","v":1.27},null,{"$f":"F7*TAUX!$C$62","v":1.7506125000000001},null,{"$f":"ROUND(H7*TAUX!$C$62,2)","v":2.64}]
[null,"total taxes",null,{"$f":"ROUND(C8+C9,10)","v":1.91},null,{"$f":"E8+E9","v":2.6281125000000003},null,{"$f":"ROUNDUP(G8+G9,2)","v":3.9699999999999998}]
[null,"pourboire"]
[null,"maximum admissible",null,{"$f":"SUM(D7:D11)","v":14.66},null,{"$f":"SUM(F7:F11)","v":20.178112500000001},null,{"$f":"ROUND(SUM(H7:H11),2)","v":30.47}]
[]
[]
[null,null,null,"J'AI JOUÉ AVEC LES ARRONDIS POUR QUE LES TOUS LES MONTANTS S'ADDITIONNENT BIEN"]
[]
[]
[]
[]
[null,"ATTENTION:"]
[]
["NE RIEN MODIFIER DANS CE TABLEAU."]
["TOUS LES CALCULS SONT AUTOMATIQUES EN FONCTION DES DONNÉES INSCRITES DANS L'ONGLET TAUX."]
["SI CHANGEMENT DE MONTANT ADMISSIBLE OU DES TAUX DE TPS OU DE TVQ, FAIRE LES MODIFICATIONS DANS ONGLET TAUX"]