{"text_format":"1","workbook":"xlsx","n_sheets":18,"sheets":["Accueil","Général","Rapport d'activités","Informations complémentaires","Aide-mémoire hébergement repas","Calendrier jours fériés","Attente","Calculs temps attente","Calculs choix indemnité","Divers","Hébergement","Repas","Garde","Stationnement","Choix","Jours fériés","TAUX","Calculs repas"],"not_rendered":{"charts":0,"images":17,"macros":1,"external_links":1,"defined_names":28,"comments":3,"pivot_tables":0},"unopened":[],"bounds":{"document_bytes":16777216,"sheet_cells":100000,"rows_first":2000,"rows_last":500,"rows_between":2000,"halvings":0,"cell_chars":16384,"cell_head_chars":4096},"cells_cut":0,"cells_raw":0,"read":"whole","date_system":"1900"}

{"sheet":"Accueil","index":0,"n_rows":0,"n_cols":0,"rows_kept":0,"cut":false,"hidden":false,"merged":[[15,0,15,3]]}

{"sheet":"Général","index":1,"n_rows":98,"n_cols":20,"rows_kept":98,"cut":false,"hidden":false,"merged":[[63,2,63,11],[64,2,64,5],[21,7,21,9],[66,2,66,11],[10,3,10,4],[19,3,19,9],[53,3,53,7],[56,4,56,7],[12,2,15,2],[2,2,2,4],[3,2,3,4],[4,2,4,4],[9,9,9,11],[7,3,7,4],[9,6,9,7],[1,6,1,9],[8,9,8,11],[2,6,2,9],[3,6,3,9],[4,6,4,9],[8,6,8,7],[100,2,100,11],[57,4,57,7],[73,4,73,7],[87,4,87,7],[91,2,91,3],[90,2,90,3],[80,2,80,10],[93,2,93,3],[88,2,89,3],[82,4,82,7],[84,4,84,7],[83,4,83,7],[92,2,92,3],[77,4,77,6],[72,4,72,7],[58,4,58,7]]}
[]
[null,null,null,"Nom du transporteur",null,null,"Responsable de la facturation",null,null,null,null,"Numéro de dossier"]
[]
[null,null,"Adresse",null,null,null,"Téléphone",null,null,null,null,"# facture"]
[]
[null,null,"Personne transportée"]
[null,null,"Nom","Prénom",null,null,"Préposés au transport"]
[null,null,null,null,null,null,"Nom",null,null,"Prénom"]
[null,null,"Coroner"]
[null,null,"Nom","Prénom"]
[]
[]
[null,null,"Date et heure du départ des installations, et date et heure de l'arrivée aux installations.",null,null,null,"Départ",null,null,null,null,"Arrivée"]
[null,null,null,null,null,"Date  ",null,null,null,null,"Date  "]
[null,null,null,null,null,null,{"$f":"IFERROR(CONCATENATE('Jours fériés'!E31,\" / \",'Jours fériés'!E32),\"\")","v":""},null,null,null,null,{"$f":"IFERROR(CONCATENATE( 'Jours fériés'!E34,\" / \",'Jours fériés'!E35),\"\")","v":""}]
{"$rows_left_out":84}
{"sheet":"Rapport d'activités","index":2,"n_rows":64,"n_cols":12,"rows_kept":64,"cut":false,"hidden":true,"merged":[[51,2,51,6],[39,8,39,9],[1,10,1,11],[4,1,4,4],[4,6,4,8],[4,10,4,11],[22,8,22,9],[10,4,10,6],[1,1,1,4],[2,1,2,4]]}
[]
[null,"Maison funéraire",null,null,null,null,null,null,null,null,"No dossier"]
[]
[]
[null,"Personne transportée",null,null,null,null,"Coroner",null,null,null,"Appel"]
[null,"Nom",null,null,"Prénom",null,"Nom",null,"Prénom",null,"Date","Heure"]
[]
[]
[]
[]
[null,null,null,null,"Préposés au transport"]
[null,null,"Départ des installations",null,"Nom",null,"Prénom"]
[null,"Date  ",null,null,null,null,null,null,null,null,{"$f":"IFERROR(CONCATENATE( 'Jours fériés'!E34,\" / \",'Jours fériés'!E35),\"\")","v":""}]
[null,"Heure  "]
[]
{"$rows_left_out":50}
{"sheet":"Informations complémentaires","index":3,"n_rows":0,"n_cols":0,"rows_kept":0,"cut":false,"hidden":false,"merged":[]}

{"sheet":"Aide-mémoire hébergement repas","index":4,"n_rows":22,"n_cols":10,"rows_kept":22,"cut":false,"hidden":false,"merged":[[20,1,20,9],[2,0,2,10],[7,0,11,0],[13,0,19,0]]}
[]
[null,null,null,null,null,null,null,null,null,"Bureau du coroner"]
["AIDE MÉMOIRE DÉPENSES D'HÉBERGEMENT ET DE REPAS REMBOURSABLES"]
[]
[]
[null,"Durée du déplacement *",null,"Coucher",null,"Repas",null,"Preuve",null,"Indemnité journalière"]
[]
["SANS COUCHER"]
[null,"Moins de 12 heures",null,"N/A",null,"Remboursement des dépenses réelles en fonction des montants maximums prévus",null,"Factures originales",null,"N/A"]
[]
[null,"Plus de 12 heures sans coucher",null,"N/A",null,"Remboursement des dépenses réelles en fonction des montants maximums prévus",null,"Preuve de déplacement à destination","OU","50 % de l'indemnité journalière"]
[]
[]
["AVEC COUCHER"]
[null,"Entre 12 et 18 heures avec coucher",null,"Remboursement des dépenses réelles en fonction des montants maximums prévus",null,"Remboursement des dépenses réelles en fonction des montants maximums prévus",null,"Factures d'hébergement et de repas en fonction des maximums prévus + Dates et heures de départ et d'arrivée","OU","50 % de l'indemnité journalière"]
{"$rows_left_out":8}
{"sheet":"Calendrier jours fériés","index":5,"n_rows":25,"n_cols":7,"rows_kept":25,"cut":false,"hidden":false,"merged":[[6,1,6,6],[8,1,8,2],[1,3,2,5]]}
[]
[]
[]
[]
[]
[]
[null,"Calendrier des jours fériés 2022 à 2025"]
[]
[null,"Événement",null,2022,2023,2024,2025]
[null,null,"Jour de l'An","samedi 1er janvier 2022","dimanche 1er janvier 2023","lundi 1er janvier 2024","mercredi 1er janvier 2025"]
[null,null,"Lendemain du jour de l'An","dimanche 2 janvier 2022","lundi 2 janvier 2023","mardi 2 janvier 2024","jeudi 2 janvier 2025"]
[null,null,"Vendredi saint","vendredi 15 avril 2022","vendredi 7 avril 2023","vendredi 29 mars 2024","vendredi 18 avril 2025"]
[null,null,"Lundi de Pâques","lundi 18 avril 2022","lundi 10 avril 2023","lundi 1er avril 2024","lundi 21 avril 2025"]
[null,null,"Journée internationale des Patriotes","lundi 23 mai 2022","lundi 22 mai 2023","lundi 20 mai 2024","lundi 19 mai 2025"]
[null,null,"Fête nationale du Québec","vendredi 24 juin 2022","samedi 24 juin 2023","lundi 24 juin 2024","mardii 24 juin 2025"]
{"$rows_left_out":11}
{"sheet":"Attente","index":6,"n_rows":50,"n_cols":10,"rows_kept":50,"cut":false,"hidden":true,"merged":[[50,1,55,9],[46,1,47,9],[44,1,44,9],[16,3,16,5],[25,3,25,5],[17,9,19,9],[26,9,28,9],[34,3,34,5],[35,9,37,9]]}
[]
[]
[null,null,null,null,null,null,null,null,null,{"$f":"Général!L3","v":0}]
[]
[]
[null,"Remplir les cellules jaunes seulement, au besoin."]
[null,"Utilisez le format aaaa-mm-jj pour les dates."]
[null,"   Exemple: 4 mars 2021: inscrivez 2021-03-04"]
[null,"Utilisez le format 24 heures."]
[null,"  Exemple: 8 h 30 le matin: inscrivez 8:30 Pour minuit et 10 minutes inscrivez 0:10"]
[]
[]
[]
[null,null,null,"Début",null,"Fin",null,"Heure de fin modifiée*",null,"Coûts remboursables"]
[]
{"$rows_left_out":36}
{"sheet":"Calculs temps attente","index":7,"n_rows":111,"n_cols":16,"rows_kept":111,"cut":false,"hidden":true,"merged":[[81,9,81,10],[81,11,81,12],[6,19,6,20],[19,9,19,10],[19,11,19,12],[50,9,50,10],[50,11,50,12]]}
[null,null,"TEMPS D'ATTENTE"]
[]
[null,null,"Semaine / Jour_soir",{"$f":"TAUX!$C6","v":28.75},null,null,"NE RIEN MODIFIER DANS CE TABLEAU SOUS PEINE D'ÉLECTROCUTION"]
[null,null,"Semaine / Nuit",{"$f":"TAUX!$C7","v":35.5}]
["00:00:00",null,"Fin de semaine / Jour_soir",{"$f":"TAUX!$C8","v":31.75}]
["23:59:00",null,"Fin de semaine / Nuit",{"$f":"TAUX!$C9","v":38.5}]
[{"$f":"TEXT(A6,\"hh:mm\")","v":"23:59"},null,"Férié / Jour_soir",{"$f":"TAUX!$C10","v":40}]
[{"$f":"TEXT(A9,\"hh:mm\")","v":"08:00"},null,"Férié / Nuit",{"$f":"TAUX!$C11","v":48}]
["08:00:00"]
[1]
[null,null,null,null,null,null,"Attente 1"]
[]
[null,"Début","Fin"]
["Date début /  fin",{"$f":"Attente!D19","v":"00:00:00"},{"$f":"Attente!F19","v":"00:00:00"},{"$f":"TEXT(B14,\"aaaa-mm-jj \")&TEXT(B15,\"hh:mm\")","v":"1900-01-00 00:00"}]
["Heure début / fin",{"$f":"Attente!D21","v":"00:00:00"},{"$f":"TEXT(Attente!F21,\"hh:mm\")","v":"00:00"},{"$f":"TEXT(C14,\"aaaa-mm-jj \")&TEXT(C15,\"hh:mm\")","v":"1900-01-00 00:00"},null,{"$f":"IF(AND(B16>A8,B16<A7),B16,\"\")","v":""}]
{"$rows_left_out":97}
{"sheet":"Calculs choix indemnité","index":8,"n_rows":38,"n_cols":7,"rows_kept":38,"cut":false,"hidden":true,"merged":[[9,3,9,10],[10,3,10,10],[35,0,35,6],[32,0,32,5],[34,0,34,5],[33,0,33,5],[18,2,18,7]]}
[]
[]
["NE RIEN MODIFIER DANS CE TABLEAU SOUS PEINE D'ÉLECTROCUTION"]
[]
[null,null,"1er trsp"]
[]
[{"$f":"IF(Général!$G$14=\"\",\"\",(TEXT(Général!$G$14,\"aaaa-mm-jj\")))","v":""},{"$f":"IF(Général!$L$14=\"\",\"\",TEXT(Général!$L$14,\"aaaa-mm-jj\"))","v":""}]
[{"$f":"IF(Général!$G$16=\"\",\"\",TEXT(Général!$G$16,\"hh:mm\"))","v":""},{"$f":"IF(Général!$L$16=\"\",\"\",TEXT(Général!$L$16,\"hh:mm\"))","v":""},{"$f":"B9-A9","v":{"$error":"#VALUE!"}}]
[{"$f":"A7&\" \"&A8","v":" "},{"$f":"B7&\" \"&B8","v":" "}]
[{"$f":"B9-A9","v":{"$error":"#VALUE!"}},{"$f":"IF(A10<A12,A21,IF(AND(A10>=A12,Hébergement!D17=\"\"),A22,IF(A10<A13,A23,IF(A10<A14,A24,IF(A10>A14,A25)))))","v":{"$error":"#VALUE!"}},null,"Inscrivez d'abord les dépenses réelles dans Repas et Stationnement. Choisissez ensuite la ville de votre destination. Enfin, utilisez le bouton Choix pour effectuer un choix entre l'indemnité journalière ou les dépenses réelles."]
[{"$f":"TEXT(B9-A9,\"[hh]:mm\")","v":{"$error":"#VALUE!"}}," et comprend un coucher.",null,"Inscrivez d'abord les dépenses réelles dans Repas, Hébergement et Stationnement. Utilisez ensuite le bouton Choix pour effectuer un choix entre l'indemnité journalière ou les dépenses réelles."]
["12:00:00"," et ne comprend pas de coucher."]
[0.75]
[1]
["choisi dans Hébergement","choisi dans Hébergement","pour faciliter l'indexation","Indemnité de 50 %","Indemnité de 100 %","nombre de préposés"]
{"$rows_left_out":24}
{"sheet":"Divers","index":9,"n_rows":1168,"n_cols":8,"rows_kept":1168,"cut":false,"hidden":true,"merged":[]}
[]
[null,null,null,null,null,null,null,"Non"]
[null,null,"Pour calculer les frais de garde",null,null,"Période de coucher",null,"Oui"]
[]
[null,null,null,null,null,"Entre le 1er juillet et le 31 octobre"]
[null,null,"Cumulatif période de garde de 24 heures",null,null,"Entre le 1er novembre et le 30 juin"]
[null,"1 jour",1,null,null,null,"Entre le 1er novembre et le 30 juin","entre le 1er juillet et le 31 octobre"]
[null,"2 jours",2,null,null,"Montréal",{"$f":"TAUX!C50","v":218},{"$f":"TAUX!D50","v":234}]
[null,"3 jours",3,null,null,"Québec",{"$f":"TAUX!C51","v":192},{"$f":"TAUX!D51","v":192}]
[null,"4 jours",4,null,null,"Laval",{"$f":"TAUX!C52","v":187},{"$f":"TAUX!D52","v":197}]
[null,"5 jours",5,null,null,"Gatineau",{"$f":"TAUX!C53","v":187},{"$f":"TAUX!D53","v":197}]
[null,"6 jours",6,null,null,"Longueuil",{"$f":"TAUX!C54","v":187},{"$f":"TAUX!D54","v":197}]
[null,"7 jours",7,null,null,"Lac-Beauport",{"$f":"TAUX!C55","v":187},{"$f":"TAUX!D55","v":197}]
[null,"8 jours",8,null,null,"Lac-Delage",{"$f":"TAUX!C56","v":187},{"$f":"TAUX!D56","v":197}]
[null,"9 jours",9,null,null,"Rimouski",{"$f":"TAUX!C57","v":163},{"$f":"TAUX!D57","v":168}]
{"$rows_left_out":1154}
{"sheet":"Hébergement","index":10,"n_rows":31,"n_cols":6,"rows_kept":31,"cut":false,"hidden":true,"merged":[[8,1,8,5],[31,1,34,5]]}
[]
[]
[null,null,null,null,null,{"$f":"Général!L3","v":0}]
[]
[]
[]
[]
[]
[null,{"$f":"IF(OR(Général!J65=2,'Calculs choix indemnité'!A10<'Calculs choix indemnité'!A12),\n\"ATTENTION: Vous ne pouvez demander le remboursement des frais d'hébergement.\",\n\"\")","v":{"$error":"#VALUE!"}}]
[]
[null,"Remplir les cellules jaunes seulement, si votre transport comprend un coucher."]
[]
[]
[null,null,null,{"$f":"CONCATENATE(Général!G9,\" \",Général!J9)","v":" "},null,{"$f":"CONCATENATE(Général!G10,\" \",Général!J10)","v":" "}]
[]
{"$rows_left_out":17}
{"sheet":"Repas","index":11,"n_rows":79,"n_cols":15,"rows_kept":79,"cut":false,"hidden":true,"merged":[[13,3,13,5],[16,13,16,14],[13,8,13,10],[79,1,81,12],[48,13,48,14],[46,1,46,12]]}
[]
[]
[]
[null,null,null,null,null,null,null,null,null,null,null,{"$f":"Général!L3","v":0}]
[]
[]
[]
[]
[]
[]
[null,"Remplir les cellules jaunes seulement. Inscrire le coût des repas sans taxes, et les pourboires séparément."]
[]
[]
[null,null,null,{"$f":"CONCATENATE(Général!G9,\" \",Général!J9)","v":" "},null,null,null,null,{"$f":"CONCATENATE(Général!G10,\" \",Général!J10)","v":" "}]
[]
{"$rows_left_out":65}
{"sheet":"Garde","index":12,"n_rows":36,"n_cols":11,"rows_kept":36,"cut":false,"hidden":true,"merged":[[32,1,33,10],[36,1,41,10]]}
[]
[]
[]
[null,null,null,null,null,null,null,null,null,null,{"$f":"Général!L3","v":0}]
[]
[]
[]
[null,"Remplir les cellules jaunes seulement."]
[null,null,null,"Début",null,"Fin","date en texte et heure en texte","date en texte et heure en texte","Début / Fin","Durée en heures et minutes","Nombre de périodes"]
[]
[]
[null,"Date:",null,null,null,null,{"$f":"IF(D12=\"\",\"\",(TEXT(D12,\"aaaa-mm-jj\")))","v":""},{"$f":"IF(F12=\"\",\"\",TEXT(F12,\"aaaa-mm-jj\"))","v":""},{"$f":"G12&\" \"&G14","v":" "}]
[]
[null,"Heure:",null,null,null,null,{"$f":"IF(D14=\"\",\"\",TEXT(D14,\"hh:mm\"))","v":""},{"$f":"IF(G14=\"\",\"\",TEXT(F14,\"hh:mm\"))","v":""},{"$f":"H12&\" \"&H14","v":" "},{"$f":"IFERROR(IF(I14-I12>=0,I14-I12,\"\"),\"\")","v":""},{"$f":"IF(J14<=Divers!$C$7,1,IF(J14<=Divers!$C$8,2,IF(J14<=Divers!$C$9,3,IF(J14<=Divers!$C$10,4,IF(J14<=Divers!$C$11,5,IF(J14<=Divers!$C$12,6,IF(J14<=Divers!$C$13,7,IF(J14<=Divers!$C$14,8))))))))","v":false}]
[]
{"$rows_left_out":22}
{"sheet":"Stationnement","index":13,"n_rows":22,"n_cols":5,"rows_kept":22,"cut":false,"hidden":true,"merged":[[22,1,25,4]]}
[]
[]
[]
[]
[null,null,null,null,{"$f":"Général!L3","v":0}]
[]
[]
[null,"Remplir les cellules jaunes seulement, au besoin."]
[]
[]
[]
[null,"Coût du stationnement","$"]
[]
[null,"Est-ce que le montant payé pour le stationnement comprend les taxes ?","Oui / non \n/ ne sait pas"]
[]
{"$rows_left_out":8}
{"sheet":"Choix","index":14,"n_rows":23,"n_cols":14,"rows_kept":23,"cut":false,"hidden":true,"merged":[[5,1,5,2],[10,1,10,2],[23,1,23,3],[12,1,12,2],[11,1,11,2],[15,1,15,2],[13,1,13,2],[14,1,14,2],[17,2,17,3]]}
[]
[]
[]
[]
[null,null,null,{"$f":"Général!L3","v":0}]
[null,{"$f":"IFERROR(IF('Calculs choix indemnité'!A10<'Calculs choix indemnité'!A12,\n\"La durée du transport est inférieure à 12 heures. Seuls les repas, s'il y a lieu, peuvent être remboursés.\",\nIF(AND('Calculs choix indemnité'!A10>'Calculs choix indemnité'!A12,Général!J65=2),\n\"La durée du transport est supérieure à 12 heures sans coucher. \"& 'Calculs choix indemnité'!A34,\nIF(AND('Calculs choix indemnité'!A10>'Calculs choix indemnité'!A12,Général!J65=1,'Calculs choix indemnité'!A10<'Calculs choix indemnité'!A13),\n\"La durée du transport se situe entre 12 et 18 heures.\"&'Calculs choix indemnité'!A34,\nIF(AND('Calculs choix indemnité'!A10>'Calculs choix indemnité'!A12,Général!J65=1,'Calculs choix indemnité'!A10<'Calculs choix indemnité'!A14),\n\"La durée du transport se situe entre 18 et 24 heures. Vous pouvez choisir de recevoir 100 % de l'indemnité journalière ou de demander le remboursement des dépenses réelles.\",\nIF(AND('Calculs choix indemnité'!A10>'Calculs choix indemnité'!A12,Général!J65=1,'Calculs choix indemnité'!A10>'Calculs choix indemnité'!A14),\n\"La durée du transport est supérieure à 24 heures. Vous pouvez choisir de recevoir 100 % de l'indemnité journalière plus les repas pris au-delà de cette période ou de demander le remboursement des dépenses réelles.\"))))),\"\")","v":""}]
[]
[null,"Pour vous aider dans votre choix:"]
[]
[null,"Calcul de l'indemnité à laquelle vous avez droit:",null,null,null,null,null,{"$f":"Général!J73","v":0}]
[null,{"$f":"IF(B6='Calculs choix indemnité'!G21,'Calculs choix indemnité'!A33,\nIF(Choix!B6='Calculs choix indemnité'!G22,'Calculs choix indemnité'!A34,\nIF(Choix!B6='Calculs choix indemnité'!G23,'Calculs choix indemnité'!A34,\nIF(Choix!B6='Calculs choix indemnité'!G24,'Calculs choix indemnité'!A35,\nIF(Choix!B6='Calculs choix indemnité'!G25,'Calculs choix indemnité'!A36,)))))","v":0}]
[null,{"$f":"IF('Calculs choix indemnité'!A10<='Calculs choix indemnité'!A12,\"Le transport a duré moins de 12 heures, vous ne pouvez effectuer un choix.\",\nIF(Général!J65=2,\"50 % de l'indemnité soit \"&H14&\",00 $ par préposé.\",\nIF(AND(Général!J65=1,Général!L65>='Calculs choix indemnité'!A12,Général!L65<'Calculs choix indemnité'!A13),\"50 % de l'indemnité soit \"&'Calculs choix indemnité'!D16&\",00 $ par préposé:\",\nIF(AND(Général!J65=1,Général!L65>='Calculs choix indemnité'!A10,Général!L65<'Calculs choix indemnité'!A14),\"100 % de l'indemnité soit \"&'Calculs choix indemnité'!E17&\",00 $ par préposé:\",\nIF('Calculs choix indemnité'!A10>='Calculs choix indemnité'!A14,\"100 % de l'indemnité soit \"&'Calculs choix indemnité'!E17&\",00 $ par préposé:\"))\n)))","v":{"$error":"#VALUE!"}},null,{"$f":"IF('Calculs choix indemnité'!A10<='Calculs choix indemnité'!A12,0,\nIF('Calculs choix indemnité'!A10>='Calculs choix indemnité'!A14,'Calculs choix indemnité'!E17*'Calculs choix indemnité'!F17,\nIF(AND('Calculs choix indemnité'!A10>='Calculs choix indemnité'!A12,Général!H65=\"non\"),H14*'Calculs choix indemnité'!F17,\nIF(AND('Calculs choix indemnité'!A10>='Calculs choix indemnité'!A12,'Calculs choix indemnité'!A10<='Calculs choix indemnité'!A13,Général!H65=\"oui\"),'Calculs choix indemnité'!D16*'Calculs choix indemnité'!F17,\nIF(AND('Calculs choix indemnité'!A10>='Calculs choix indemnité'!A13,'Calculs choix indemnité'!A10<='Calculs choix indemnité'!A14,Général!H65=\"oui\"),'Calculs choix indemnité'!E17*'Calculs choix indemnité'!F17,)))))","v":{"$error":"#VALUE!"}},null,null,null,{"$f":"IF(L16=\"2022\",L17,IF(M16=\"2023\",M17,IF(N16=\"2024\",N17,\"\")))","v":""},null,null,null,"2022-07-01","2023-07-01","2024-07-01"]
[null,{"$f":"IF('Calculs choix indemnité'!A10>='Calculs choix indemnité'!A14,\"Plus les repas pris au-delà des premiers 24 heures, s'il y a lieu:\",\"\")","v":{"$error":"#VALUE!"}},null,{"$f":"IF('Calculs choix indemnité'!A10>='Calculs choix indemnité'!A14,\nRepas!M75,\"\")","v":{"$error":"#VALUE!"}},null,null,null,{"$f":"IF(H12=\"oui\",\"haute saison\",\"basse saison\")","v":"basse saison"},null,null,null,"2022-11-01","2023-11-01","2024-11-01"]
[null,"Total:",null,{"$f":"SUM(D12:D13)","v":{"$error":"#VALUE!"}},null,null,null,{"$f":"INDEX(TAUX!G50:H58,MATCH(H10,TAUX!F50:F58,0),MATCH(H13,TAUX!G49:H49,0))","v":{"$error":"#N/A"}},null,null,null,"2022-01-01","2023-01-01","2024-01-01"]
[null,"OU",null,null,null,null,null,null,null,null,null,"2022-12-31","2023-12-31","2024-12-31"]
{"$rows_left_out":9}
{"sheet":"Jours fériés","index":15,"n_rows":1829,"n_cols":10,"rows_kept":1829,"cut":false,"hidden":true,"merged":[[0,1,0,3],[2,4,2,5],[0,4,0,9]]}
[null,"Liste des jours fériés 2022 à 2025",null,null,"Calendrier des jours fériés 2022 à 2025"]
[]
[null,"Calendrier 2021 à 2025","S ou FDS","F","Événement",null,2022,2023,2024,2025]
[null,"2021-01-01","s","Oui",null,"Jour de l'An","samedi 1er janvier 2022","dimanche 1er janvier 2023","lundi 1er janvier 2024","mercredi 1er janvier 2025"]
[null,"2021-01-02","fds","Oui",null,"Lendemain du jour de l'An","dimanche 2 janvier 2022","lundi 2 janvier 2023","mardi 2 janvier 2024","jeudi 2 janvier 2025"]
[null,"2021-01-03","fds",null,null,"Vendredi saint","vendredi 15 avril 2022","vendredi 7 avril 2023","vendredi 29 mars 2024","vendredi 18 avril 2025"]
[null,"2021-01-04","s",null,null,"Lundi de Pâques","lundi 18 avril 2022","lundi 10 avril 2023","lundi 1er avril 2024","lundi 21 avril 2025"]
[null,"2021-01-05","s",null,null,"Journée internationale des Patriotes","lundi 23 mai 2022","lundi 22 mai 2023","lundi 20 mai 2024","lundi 19 mai 2025"]
[null,"2021-01-06","s",null,null,"Fête nationale du Québec","vendredi 24 juin 2022","samedi 24 juin 2023","lundi 24 juin 2024","mardii 24 juin 2025"]
[null,"2021-01-07","s",null,null,"Fête du Canada","vendredi 1er juillet 2022","samedi 1er juillet 2023","lundi 1er juillet 2024","mardi 1er juillet 2025"]
[null,"2021-01-08","s",null,null,"Fête du Travail","lundi 5 septembre 2022","lundi 4 septembre 2023","lundi 2 septembre 2024","lundi 1er septembre 2025"]
[null,"2021-01-09","fds",null,null,"Fête de l'Action de grâces","lundi 10 octobre 2022","lundi 9 octobre 2023","lundi 14 octobre 2024","lundi 13 octobre 2025"]
[null,"2021-01-10","fds",null,null,"Veille de Noël","samedi 24 décembre 2022","dimanche 24 décembre 2023","mardi 24 décembre 2024","mercredi 24 décembre 2025"]
[null,"2021-01-11","s",null,null,"Noël","dimanche 25 décembre 2022","lundi 25 décembre 2023","mercredi 25 décembre 2024","jeudi 25 décembre 2025"]
[null,"2021-01-12","s",null,null,"Lendemain de Noël","lundi 26 décembre 2022","mardi 26 décembre 2023","jeudi 26 décembre 2024","vendredi 26 décembre 2025"]
{"$rows_left_out":1815}
{"sheet":"TAUX","index":16,"n_rows":81,"n_cols":8,"rows_kept":81,"cut":false,"hidden":true,"merged":[[46,2,46,3],[45,6,45,7],[46,6,46,7]]}
[]
[null,"champs à modifier avec les nouveaux tarifs",2025]
[]
[null,"Attente"]
[]
[null,"Semaine - jour/soir  ",28.75]
[null,"Semaine - nuit  ",35.5]
[null,"Fin semaine - jour/soir  ",31.75]
[null,"Fin semaine - nuit  ",38.5]
[null,"Fériés - jour/soir  ",40]
[null,"Fériés - nuit  ",48]
[]
[null,"Base ailleurs qu'à Québec et Montréal"]
[]
[null,"Semaine - jour/soir  ",135]
{"$rows_left_out":67}
{"sheet":"Calculs repas","index":17,"n_rows":24,"n_cols":8,"rows_kept":24,"cut":false,"hidden":true,"merged":[]}
[]
[null,null,null,null,"REPAS"]
[]
[]
[null,null,null,"Déjeuner",null,"Dîner",null,"Souper"]
[]
[null,null,null,{"$f":"TAUX!F42","v":12.75},null,{"$f":"TAUX!F43","v":17.55},null,{"$f":"TAUX!F44","v":26.5}]
[null,"TPS",{"$f":"ROUND(D7*TAUX!$C$61,2)","v":0.64},null,{"$f":"F7*TAUX!$C$61","v":0.87750000000000006},null,{"$f":"ROUND(H7*TAUX!$C$61,3)","v":1.325}]
[null,"TVQ",{"$f":"ROUND(D7*TAUX!$C$62,2)","v":1.27},null,{"$f":"F7*TAUX!$C$62","v":1.7506125000000001},null,{"$f":"ROUND(H7*TAUX!$C$62,2)","v":2.64}]
[null,"total taxes",null,{"$f":"ROUND(C8+C9,10)","v":1.91},null,{"$f":"E8+E9","v":2.6281125000000003},null,{"$f":"ROUNDUP(G8+G9,2)","v":3.9699999999999998}]
[null,"pourboire"]
[null,"maximum admissible",null,{"$f":"SUM(D7:D11)","v":14.66},null,{"$f":"SUM(F7:F11)","v":20.178112500000001},null,{"$f":"ROUND(SUM(H7:H11),2)","v":30.47}]
[]
[]
[null,null,null,"J'AI JOUÉ AVEC LES ARRONDIS POUR QUE LES TOUS LES MONTANTS S'ADDITIONNENT BIEN"]
{"$rows_left_out":9}