{"text_format":"1","workbook":"xlsx","n_sheets":19,"sheets":["Accueil","Général","Rapport d'activités","Informations complémentaires","Aide-mémoire hébergement repas","Calendrier jours fériés","Attente","Assistance","Calculs temps attente","Calculs choix indemnité","Divers","Hébergement","Repas","Garde","Stationnement","Choix","Jours fériés","TAUX","Calculs repas"],"not_rendered":{"charts":0,"images":3,"macros":1,"external_links":2,"defined_names":32,"comments":5,"pivot_tables":0},"unopened":[],"bounds":{"document_bytes":16777216,"sheet_cells":100000,"rows_first":2000,"rows_last":500,"rows_between":2000,"halvings":0,"cell_chars":16384,"cell_head_chars":4096},"cells_cut":0,"cells_raw":0,"read":"whole","date_system":"1900"}

{"sheet":"Accueil","index":0,"n_rows":0,"n_cols":0,"rows_kept":0,"cut":false,"hidden":false,"merged":[[15,0,15,3]]}

{"sheet":"Général","index":1,"n_rows":111,"n_cols":20,"rows_kept":111,"cut":false,"hidden":false,"merged":[[73,4,73,7],[78,2,78,5],[21,7,21,9],[54,3,54,9],[10,3,10,4],[19,3,19,9],[68,3,68,7],[71,4,71,7],[12,2,15,2],[10,6,10,7],[10,9,10,11],[2,2,2,4],[3,2,3,4],[4,2,4,4],[9,9,9,11],[7,3,7,4],[9,6,9,7],[1,6,1,9],[8,9,8,11],[2,6,2,9],[3,6,3,9],[4,6,4,9],[8,6,8,7],[113,2,113,11],[72,4,72,7],[85,4,85,7],[99,4,99,7],[104,2,104,3],[103,2,103,3],[92,2,92,10],[106,2,106,3],[100,2,101,3],[94,4,94,7],[96,4,96,7],[95,4,95,7],[105,2,105,3],[89,4,89,6],[90,9,90,10],[84,4,84,7]]}
[]
[null,null,null,"Nom du transporteur",null,null,"Responsable de la facturation",null,null,null,null,"Numéro de dossier"]
[]
[null,null,"Adresse",null,null,null,"Téléphone",null,null,null,null,"# facture"]
[]
[null,null,"Personne transportée"]
[null,null,"Nom","Prénom",null,null,"Préposés au transport"]
[null,null,null,null,null,null,"Nom",null,null,"Prénom"]
[null,null,"Coroner"]
[null,null,"Nom","Prénom"]
[]
[]
[null,null,"Date et heure du départ des installations, et date et heure de l'arrivée aux installations.",null,null,null,"Départ",null,null,null,null,"Arrivée"]
[null,null,null,null,null,"Date  ",null,null,null,null,"Date  "]
[null,null,null,null,null,null,{"$f":"IFERROR(CONCATENATE('Jours fériés'!E31,\" / \",'Jours fériés'!E32),\"\")","v":""},null,null,null,null,{"$f":"IFERROR(CONCATENATE( 'Jours fériés'!E34,\" / \",'Jours fériés'!E35),\"\")","v":""}]
[null,null,null,null,null,"Heure  ",null,null,null,null,"Heure  "]
[]
[]
[]
[null,null,"Transport","Détails",null,null,null,null,null,null,null,"Total"]
[]
[null,null,"Tarif de base",null,null,null,"Faites un choix:  ",null,null,null,null,{"$f":"IFERROR(VLOOKUP(H22,TAUX!B15:C20,2,FALSE),0)","v":0}]
[]
[null,null,"Temps d'attente",null,"En heure",null,"En centième","Taux",null,"Total"]
[null,null,null,"S / J",{"$f":"IFERROR('Calculs temps attente'!F31+'Calculs temps attente'!F32,\"\")","v":""},null,{"$f":"IFERROR('Calculs temps attente'!G31+'Calculs temps attente'!G32,\"\")","v":""},{"$f":"TAUX!$C$6","v":29.25},null,{"$f":"IFERROR(H25*G25,\"\")","v":""}]
[null,null,null,"S / N",{"$f":"IFERROR('Calculs temps attente'!F37,\"\")","v":""},null,{"$f":"IFERROR('Calculs temps attente'!G37,\"\")","v":""},{"$f":"TAUX!$C$7","v":36.25},null,""]
[null,null,null,"FDS / J",{"$f":"IFERROR('Calculs temps attente'!F33+'Calculs temps attente'!F34,\"\")","v":""},null,{"$f":"IFERROR('Calculs temps attente'!G33+'Calculs temps attente'!G34,\"\")","v":""},{"$f":"TAUX!$C$8","v":32.5},null,""]
[null,null,null,"FDS / N",{"$f":"IFERROR('Calculs temps attente'!F38,\"\")","v":""},null,{"$f":"IFERROR('Calculs temps attente'!G38,\"\")","v":""},{"$f":"TAUX!$C$9","v":39.25},null,""]
[null,null,null,"F / J",{"$f":"IFERROR('Calculs temps attente'!F35+'Calculs temps attente'!F36,\"\")","v":""},null,{"$f":"IFERROR('Calculs temps attente'!G35+'Calculs temps attente'!G36,\"\")","v":""},{"$f":"TAUX!$C$10","v":40.75},null,""]
[null,null,null,"F / N",{"$f":"IFERROR('Calculs temps attente'!F39,\"\")","v":""},null,{"$f":"IFERROR('Calculs temps attente'!G39,\"\")","v":""},{"$f":"TAUX!$C$11","v":49},null,""]
[null,null,null,null,{"$f":"IFERROR(E25+E26+E27+E28+E29+E30,\"\")","v":""},null,{"$f":"SUM(G25:G30)","v":0},null,null,{"$f":"SUM(J25:J30)","v":0},null,{"$f":"J31","v":0}]
[]
[null,null,"Temps d'attente",null,"En heure",null,"En centième","Taux",null,"Total"]
[null,null,null,"S / J",{"$f":"IFERROR('Calculs temps attente'!F62+'Calculs temps attente'!F63,\"\")","v":""},null,{"$f":"IFERROR('Calculs temps attente'!G62+'Calculs temps attente'!G63,\"\")","v":""},{"$f":"TAUX!$C$6","v":29.25},null,{"$f":"IFERROR(H34*G34,\"\")","v":""}]
[null,null,null,"S / N",{"$f":"IFERROR('Calculs temps attente'!F68,\"\")","v":""},null,{"$f":"IFERROR('Calculs temps attente'!G68,\"\")","v":""},{"$f":"TAUX!$C$7","v":36.25},null,""]
[null,null,null,"FDS / J",{"$f":"IFERROR('Calculs temps attente'!F64+'Calculs temps attente'!F65,\"\")","v":""},null,{"$f":"IFERROR('Calculs temps attente'!G64+'Calculs temps attente'!G65,\"\")","v":""},{"$f":"TAUX!$C$8","v":32.5},null,""]
[null,null,null,"FDS / N",{"$f":"IFERROR('Calculs temps attente'!F69,\"\")","v":""},null,{"$f":"IFERROR('Calculs temps attente'!G69,\"\")","v":""},{"$f":"TAUX!$C$9","v":39.25},null,"",null,null,null,null,null,null,null,null,null," "]
[null,null,null,"F / J",{"$f":"IFERROR('Calculs temps attente'!F66+'Calculs temps attente'!F67,\"\")","v":""},null,{"$f":"IFERROR('Calculs temps attente'!G66+'Calculs temps attente'!G67,\"\")","v":""},{"$f":"TAUX!$C$10","v":40.75},null,""]
[null,null,null,"F / N",{"$f":"IFERROR('Calculs temps attente'!F70,\"\")","v":""},null,{"$f":"IFERROR('Calculs temps attente'!G70,\"\")","v":""},{"$f":"TAUX!$C$11","v":49},null,""]
[null,null,null,null,{"$f":"IFERROR(E34+E35+E36+E37+E38+E39,\"\")","v":""},null,{"$f":"SUM(G34:G39)","v":0},null,null,{"$f":"SUM(J34:J39)","v":0},null,{"$f":"J40","v":0}]
[]
[null,null,"Temps d'attente",null,"En heure",null,"En centième","Taux",null,"Total"]
[null,null,null,"S / J",{"$f":"(IFERROR('Calculs temps attente'!F93+'Calculs temps attente'!F94,\"\"))","v":""},null,{"$f":"IFERROR('Calculs temps attente'!G93+'Calculs temps attente'!G94,\"\")","v":""},{"$f":"TAUX!$C$6","v":29.25},null,{"$f":"IFERROR(H43*G43,\"\")","v":""}]
[null,null,null,"S / N",{"$f":"IFERROR('Calculs temps attente'!F99,\"\")","v":""},null,{"$f":"IFERROR('Calculs temps attente'!G99,\"\")","v":""},{"$f":"TAUX!$C$7","v":36.25},null,""]
[null,null,null,"FDS / J",{"$f":"IFERROR('Calculs temps attente'!F95+'Calculs temps attente'!F96,\"\")","v":""},null,{"$f":"IFERROR('Calculs temps attente'!G95+'Calculs temps attente'!G96,\"\")","v":""},{"$f":"TAUX!$C$8","v":32.5},null,""]
[null,null,null,"FDS / N",{"$f":"IFERROR('Calculs temps attente'!F100,\"\")","v":""},null,{"$f":"IFERROR('Calculs temps attente'!G100,\"\")","v":""},{"$f":"TAUX!$C$9","v":39.25},null,"",null,null,null,null,null,null,null,null,null," "]
[null,null,null,"F / J",{"$f":"IFERROR('Calculs temps attente'!F97+'Calculs temps attente'!F98,\"\")","v":""},null,{"$f":"IFERROR('Calculs temps attente'!G97+'Calculs temps attente'!G98,\"\")","v":""},{"$f":"TAUX!$C$10","v":40.75},null,""]
[null,null,null,"F / N",{"$f":"IFERROR('Calculs temps attente'!F101,\"\")","v":""},null,{"$f":"IFERROR('Calculs temps attente'!G101,\"\")","v":""},{"$f":"TAUX!$C$11","v":49},null,""]
[null,null,null,null,{"$f":"IFERROR(E43+E44+E45+E46+E47+E48,\"\")","v":""},null,{"$f":"SUM(G43:G48)","v":0},null,null,{"$f":"SUM(J43:J48)","v":0},null,{"$f":"J49","v":0}]
[]
[]
[null,null,null,null,null,null,null,null,null,"Total Transport",null,{"$f":"SUM(L22:L51)","v":0}]
[]
[]
[null,null,"Assistance à l'examinateur","Détails",null,null,null,null,null,null,null,"Total"]
[]
[null,null,null,null,"En heure",null,"En centième","Taux",null,"Total"]
[null,null,null,"S / J",{"$f":"IFERROR('Calculs temps attente'!B124+'Calculs temps attente'!B125,\"\")","v":""},null,{"$f":"IFERROR('Calculs temps attente'!E124+'Calculs temps attente'!E125,\"\")","v":""},{"$f":"TAUX!$C6","v":29.25},null,{"$f":"IFERROR(H58*G58,\"\")","v":""}]
[null,null,null,"S / N",{"$f":"IFERROR('Calculs temps attente'!C130,\"\")","v":""},null,{"$f":"IFERROR('Calculs temps attente'!E130,\"\")","v":""},{"$f":"TAUX!$C7","v":36.25},null,""]
[null,null,null,"FDS / J",{"$f":"IFERROR('Calculs temps attente'!B126+'Calculs temps attente'!B127,\"\")","v":""},null,{"$f":"IFERROR('Calculs temps attente'!E126+'Calculs temps attente'!E127,\"\")","v":""},{"$f":"TAUX!$C8","v":32.5},null,""]
[null,null,null,"FDS / N",{"$f":"IFERROR('Calculs temps attente'!C131,\"\")","v":""},null,{"$f":"IFERROR('Calculs temps attente'!E131,\"\")","v":""},{"$f":"TAUX!$C9","v":39.25},null,""]
[null,null,null,"F / J",{"$f":"IFERROR('Calculs temps attente'!B128+'Calculs temps attente'!B129,\"\")","v":""},null,{"$f":"IFERROR('Calculs temps attente'!E128+'Calculs temps attente'!E129,\"\")","v":""},{"$f":"TAUX!$C10","v":40.75},null,""]
[null,null,null,"F / N",{"$f":"IFERROR('Calculs temps attente'!C132,\"\")","v":""},null,{"$f":"IFERROR('Calculs temps attente'!E132,\"\")","v":""},{"$f":"TAUX!$C11","v":49},null,""]
[null,null,null,null,{"$f":"IFERROR(E58+E59+E60+E61+E62+E63,\"\")","v":""},null,{"$f":"SUM(G58:G63)","v":0},null,null,{"$f":"SUM(J58:J63)","v":0}]
[null,null,null,null,null,null,null,null,null,"Total Assistance à l'examinateur",null,{"$f":"J64","v":0}]
[]
[]
[]
[null,null,"Autres frais","Détails",null,null,null,null,null,"Tarifs",null,"Total"]
[]
[null,null,"Frais de garde",{"$f":"Garde!K29","v":0},null,null,null,null,null,{"$f":"TAUX!C36","v":67},null,{"$f":"D71*J71","v":0}]
[null,null,"Frais de visite",null,null,null,null,null,null,{"$f":"TAUX!C37","v":67},null,{"$f":"D72*J72","v":0}]
[null,null,"Nettoyage supplémentaire",null,null,null,null,null,null,{"$f":"TAUX!C38","v":45.75},null,{"$f":"D73*J73","v":0}]
[null,null,"Corps additionnel",null,null,null,null,null,null,{"$f":"TAUX!C39","v":125},null,{"$f":"D74*J74","v":0}]
[null,null,null,null,null,null,null,null,null,"Total Autres frais",null,{"$f":"SUM(L71:L74)","v":0}]
[]
[]
[]
[null,null,"Pour les transports dont la durée est supérieure à 12 heures, le transport comprend-il un coucher ? Faites un choix dans la cellule bleue.",null,null,null,null,{"$f":"IF(G79=\"\",\"non\",G79)","v":"non"},null,{"$f":"IF(H79=\"oui\",1,2)","v":2},null,{"$f":"'Calculs choix indemnité'!A10","v":{"$error":"#VALUE!"}}]
[null,null,null,null,null,null,null,null,null,"Dépenses réelles",null,"Indemnité journalière"]
[null,null,null,"Repas:  ","Exclus les taxes et les pourboires.",null,null,null,null,{"$f":"IFERROR(IF('Calculs choix indemnité'!A11>='Calculs choix indemnité'!A14,\nRepas!M42+Repas!M75,\nRepas!M42),0)","v":0}]
[]
[null,null,null,"Hébergement:  ","Inclus la taxe sur l'hébergement seulement.",null,null,null,null,{"$f":"IFERROR(\nIF(OR('Calculs choix indemnité'!A10<'Calculs choix indemnité'!A12,J79=2),\n0,\nHébergement!F27),)","v":0}]
[]
[null,null,null,{"$f":"IFERROR(IF(AND(L79>='Calculs choix indemnité'!A12,J79=2,G79=\"non\"),\"ATTENTION:\",\"\"),\"\")","v":""},{"$f":"IFERROR(IF(AND(L79>='Calculs choix indemnité'!A12,J79=2,G79=\"non\"),\"Veuillez choisir la ville de votre destination ->>\",\"\"),\"\")","v":""}]
[null,null,null,"Indemnité journalière:  ",{"$f":"IFERROR(IF(L86<>0,\"Vous avez choisi de demander l'indemnité journalière.\",IF('Calculs choix indemnité'!A10<'Calculs choix indemnité'!A12,\"\",\"Vous avez choisi de demander le remboursement des dépenses réelles.\")),\"\")","v":""},null,null,null,null,null,null,{"$f":"IFERROR(IF(AND(Choix!C17=1,Choix!D21=\"Vous devez choisir Dépenses réelles\"),\n0,\nIF(Choix!C17=1,Choix!D21,0)),0)","v":0}]
[]
[null,null,null,"Stationnement:  ","Exclus les taxes.",null,null,null,null,{"$f":"Stationnement!D16","v":0},null,{"$f":"J88","v":0}]
[]
[null,null,null,"Autre 1:  ",null,null,null,null,null,{"$f":"H90","v":0},null,{"$f":"H90","v":0}]
[null,null,null,null,null,null,null,"Total dépenses taxables",null,{"$f":"SUM(J81:K90)","v":0},null,{"$f":"IF(L86=0,0,L88+L86+L90)","v":0}]
[]
[null,null,null,null,null,null,null,null,null,null,null,"Coûts réels"]
[null,null,"Pourboires",null,null,null,null,null,null,null,null,{"$f":"IFERROR(IF(AND('Calculs choix indemnité'!A10>='Calculs choix indemnité'!A14,Choix!C17=2),\n Repas!M77+Repas!M44,\nIF(AND('Calculs choix indemnité'!A10>='Calculs choix indemnité'!A14,Choix!C17=1),\nRepas!M77,\nRepas!M44\n)),\"\")","v":""}]
[null,null,"Traversier"]
[null,null,"Péage"]
[null,null,"Autre 2"]
[null,null,null,null,null,null,null,null,null,"Total dépenses non taxables",null,{"$f":"SUM(L94:L97)","v":0}]
[]
[]
[null,null,"Ces numéros sont obligatoires si vous vous servez de cette feuille comme facture.",null,null,null,null,null,null,"Total Transport",null,{"$f":"L52","v":0}]
[null,null,null,null,null,null,null,null,null,"Total Autres frais",null,{"$f":"L75","v":0}]
[null,null,null,null,null,null,null,null,null,"Total Assistance examinateur",null,{"$f":"L65","v":0}]
[null,null,"Numéro de TPS du transporteur",null,null,null,null,null,null,"Total Dépenses taxables remboursables",null,{"$f":"IF(L86>0,Général!L91,Général!J91)","v":0}]
[null,null,null,null,null,null,null,null,null,"Sous-total",null,{"$f":"SUM(L101:L104)","v":0}]
[null,null,"Numéro de TVQ du transporteur",null,null,null,null,0.05,null,"TPS",null,{"$f":"L105*TAUX!C61","v":0}]
[null,null,null,null,null,null,null,9.9750000000000005E-2,null,"TVQ",null,{"$f":"L105*TAUX!C62","v":0}]
[null,null,null,null,null,null,null,null,null,"Sous-total des taxes",null,{"$f":"ROUNDUP(L106+L107,3)","v":0}]
[null,null,null,null,null,null,null,null,null,"Total des services facturables et des dépenses taxables remboursables",null,{"$f":"L101+L102+L103+L104+L106+L107","v":0}]
[null,null,null,null,null,null,null,null,null,"Total Dépenses non taxables remboursables",null,{"$f":"L98","v":0}]
[null,null,null,null,null,null,null,null,null,"Total des services facturables et des dépenses remboursables",null,{"$f":"L109+L110","v":0}]

{"sheet":"Rapport d'activités","index":2,"n_rows":64,"n_cols":12,"rows_kept":64,"cut":false,"hidden":true,"merged":[[51,2,51,6],[39,8,39,9],[1,10,1,11],[4,1,4,4],[4,6,4,8],[4,10,4,11],[22,8,22,9],[10,4,10,6],[1,1,1,4],[2,1,2,4]]}
[]
[null,"Maison funéraire",null,null,null,null,null,null,null,null,"No dossier"]
[]
[]
[null,"Personne transportée",null,null,null,null,"Coroner",null,null,null,"Appel"]
[null,"Nom",null,null,"Prénom",null,"Nom",null,"Prénom",null,"Date","Heure"]
[]
[]
[]
[]
[null,null,null,null,"Préposés au transport"]
[null,null,"Départ des installations",null,"Nom",null,"Prénom"]
[null,"Date  ",null,null,null,null,null,null,null,null,{"$f":"IFERROR(CONCATENATE( 'Jours fériés'!E34,\" / \",'Jours fériés'!E35),\"\")","v":""}]
[null,"Heure  "]
[]
[]
[]
[null,"Morgue Québec","Morgue Montréal",null,"Hôpital",null,"Résidence privée",null,null,"Autre"]
[]
[null,"Détails:",null,null,null,null,"Ville: ____________________________________"]
[]
[]
[null,null,null,null,"Biens",null,null,null,"Remise du corps"]
[null,"Heure d'arrivée:",null,null,"Objets ","Boîte ",null,"Préposé au coroner"]
[null,"Heure de départ:",null,null,"Documents ","Sac ",null,"Agent de sécurité "]
[null,"Temps d'attente:",null,null,"Enveloppe 3 ","Autre ",null,"Policier "]
[null,null,null,null,null,null,null,"Coroner "]
[null,null,null,null,null,null,null,"Autre "]
[]
[null,null,null,null,"Signature: ______________________________",null,null,"Signature: ______________________________"]
[]
[]
[]
[null,"Morgue Québec","Morgue Montréal",null,"Hôpital",null,"Résidence privée",null,null,"Autre"]
[]
[null,"Détails:",null,null,null,null,"Ville:"]
[]
[]
[]
[null,null,null,null,"Biens",null,null,null,"Remise du corps"]
[null,"Heure d'arrivée:",null,null,"Objets ","Boîte ",null,"Préposé au coroner"]
[null,"Heure de départ:",null,null,"Documents ","Sac ",null,"Agent de sécurité "]
[null,"Temps d'attente:",null,null,"Enveloppe 3 ","Autre ",null,"Policier "]
[null,null,null,null,null,null,null,"Coroner "]
[null,null,null,null,null,null,null,"Autre "]
[]
[null,null,null,null,"Signature: ______________________________",null,null,"Signature: ______________________________"]
[]
[]
[]
[]
[null,null,"Arrivée aux installations"]
[]
[null,"Date  ",null,null,"Heure  "]
[]
[]
[]
[null,"Garde: Date: __________ Heure: __________  Date: __________ Heure: __________   Date: __________ Heure: __________"]
[null,"Corps additionnel(s):   Nom: ___________________________  Prénom: __________________________ No dossier: _______________"]
[null,"Nettoyage supplémentaire:  oui _____   non _____  Justification: ________________________________________"]
[null,"Visites: Date: _______  Heure: _______"]
[null,"  Nom: ____________________  Prénom: __________________ Fonction: __________________________ Signature: _____________________________________"]
[null,"Visites: Date: _______  Heure: _______"]
[null,"  Nom: ____________________  Prénom: __________________ Fonction: __________________________ Signature: _____________________________________"]

{"sheet":"Informations complémentaires","index":3,"n_rows":0,"n_cols":0,"rows_kept":0,"cut":false,"hidden":false,"merged":[]}

{"sheet":"Aide-mémoire hébergement repas","index":4,"n_rows":22,"n_cols":10,"rows_kept":22,"cut":false,"hidden":false,"merged":[[20,1,20,9],[2,0,2,10],[7,0,11,0],[13,0,19,0]]}
[]
[null,null,null,null,null,null,null,null,null,"Bureau du coroner"]
["AIDE MÉMOIRE DÉPENSES D'HÉBERGEMENT ET DE REPAS REMBOURSABLES"]
[]
[]
[null,"Durée du déplacement *",null,"Coucher",null,"Repas",null,"Preuve",null,"Indemnité journalière"]
[]
["SANS COUCHER"]
[null,"Moins de 12 heures",null,"N/A",null,"Remboursement des dépenses réelles en fonction des montants maximums prévus",null,"Factures originales",null,"N/A"]
[]
[null,"Plus de 12 heures sans coucher",null,"N/A",null,"Remboursement des dépenses réelles en fonction des montants maximums prévus",null,"Preuve de déplacement à destination","OU","50 % de l'indemnité journalière"]
[]
[]
["AVEC COUCHER"]
[null,"Entre 12 et 18 heures avec coucher",null,"Remboursement des dépenses réelles en fonction des montants maximums prévus",null,"Remboursement des dépenses réelles en fonction des montants maximums prévus",null,"Factures d'hébergement et de repas en fonction des maximums prévus + Dates et heures de départ et d'arrivée","OU","50 % de l'indemnité journalière"]
[]
[null,"Entre 18 et 24 avec coucher",null,"Remboursement des dépenses réelles en fonction des montants maximums prévus",null,"Remboursement des dépenses réelles en fonction des montants maximums prévus",null,"Factures d'hébergement et de repas en fonction des maximums prévus + Dates et heures de départ et d'arrivée","OU","100 % de l'indemnité journalière"]
[]
[null,"Plus de 24 heures avec coucher",null,"Remboursement des dépenses réelles en fonction des montants maximums prévus",null,"Remboursement des dépenses réelles en fonction des montants maximums prévus",null,"Factures d'hébergement et de repas en fonction des maximums prévus + Dates et heures de départ et d'arrivée","OU","100 % de l'indemnité journalière + les repas pris au-delà des 24 heures"]
[]
[null,"* Un déplacement débute au moment du départ des préposés au transport des installations du transporteur jusqu'au moment de leur retour aux installations du transporteur."]
[null,null,null,null,null,null,null,null,null,"2021-12-15"]

{"sheet":"Calendrier jours fériés","index":5,"n_rows":25,"n_cols":26,"rows_kept":25,"cut":false,"hidden":false,"merged":[[8,1,8,2],[1,3,2,5],[4,1,4,3]]}
[]
[]
[]
[]
[null,"Calendrier des jours fériés 2024 à 2046"]
[]
[null,"Cette liste représente les jours de fête accordés aux employés du gouvernement du Québec. Ce n'est pas la liste des jours de congé accordés."]
[]
[null,"Événements",null,2024,2025,2026,2027,2028,2029,2030,2031,2032,2033,2034,2035,2036,2037,2038,2039,2040,2041,2042,2043,2044,2045,2046]
[null,null,"Jour de l'An","lundi 1er janvier 2024","mercredi 1er janvier 2025","jeudi 1er janvier 2026","vendredi 1er janvier 2027","samedi 1er janvier 2028","lundi 1er janvier 2029","mardi 1er janvier 2030","mercredi 1er janvier 2031","jeudi 1er janvier 2032","samedi 1er janvier 2033","dimanche 1er janvier 2034","lundi 1er janvier 2035","mardi 1er janvier 2036","jeudi 1er janvier 2037","vendredi 1er janvier 2038","samedi 1er janvier 2039","dimanche 1er janvier 2040","mardi 1er janvier 2041","mercredi 1er janvier 2042","jeudi 1er janvier 2043","vendredi 1er janvier 2044","dimanche 1er janvier 2045","lundi 1er janvier 2046"]
[null,null,"Lendemain du jour de l'An","mardi 2 janvier 2024","jeudi 2 janvier 2025","vendredi 2 janvier 2026","samedi 2 janvier 2027","dimanche 2 janvier 2028","mardi 2 janvier 2029","lundi 2 janvier 2030","jeudi 2 janvier 2031","vendredi 2 janvier 2032","dimanche 2 janvier 2033","lundi 2 janvier 2034","mardi 2 janvier 2035","mercredi 2 janvier 2036","vendredi 2 janvier 2037","samedi 2 janvier 2038","dimanche 2 janvier 2039","lundi 2 janvier 2040","mercredi 2 janvier 2041","jeudi 2 janvier 2042","vendredi 2 janvier 2043","samedi 2 janvier 2044","lundi 2 janvier 2045","mardi 2 janvier 2046"]
[null,null,"Vendredi saint","vendredi 29 mars 2024","vendredi 18 avril 2025","vendredi 3 avril 2026","vendredi 26 mars 2027","vendredi 14 avril 2028","vendredi 30 mars 2029","vendredi 19 avril 2030","vendredi 11 avril 2031","vendredi 26 mars 2032","vendredi 15 avril 2033","vendredi 7 avril 2034","vendredi 23 mars 2035","vendredi 11 avril 2036","vendredi 3 avril 2037","vendredi 23 avril 2038","vendredi 8 avril 2039","vendredi 30 mars 2040","vendredi 19 avril 2041","vendredi 4 avril 2042","vendredi 27 mars 2043","vendredi 15 avril 2044","vendredi 7 avril 2045","vendredi 23 mars 2046"]
[null,null,"Lundi de Pâques","lundi 1er avril 2024","lundi 21 avril 2025","lundi 5 avril 2026","lundi 29 mars 2027","lundi 17 avril 2028","lundi 2 avril 2029","lundi 22 avril 2030","lundi 14 avril 2031","lundi 29 mars 2032","lundi 18 avril 2033","lundi 10 avril 2034","lundi 26 mars 2035","lundi 14 avril 2036","lundi 6 avril 2037","lundi 26 avril 2038","lundi 11 avril 2039","lundi 2 avril 2040","lundi 22 avril 2041","lundi 7 avril 2042","lundi 30 mars 2043","lundi 18 avril 2044","lundi 10 avril 2045","lundi 26 mars 2046"]
[null,null,"Journée internationale des Patriotes","lundi 20 mai 2024","lundi 19 mai 2025","lundi 18 mai 2026","lundi 24 mai 2027","lundi 22 mai 2028","lundi 21 mai 2029","lundi 20 mai 2030","lundi 19 mai 2031","lundi 24 mai 2032","lundi 23 mai 2033","lundi 22 mai 2034","lundi 21 mai 2035","lundi 19 mai 2036","lundi 18 mai 2037","lundi 24 mai 2038","lundi 23 mai 2039","lundi 21 mai 2040","lundi 20 mai 2041","lundi 19 mai 2042","lundi 18 mai 2043","lundi 23 mai 2044","lundi 22 mai 2045","lundi 21 mai 2046"]
[null,null,"Fête nationale du Québec","lundi 24 juin 2024","mardi 24 juin 2025","mercredi 24 juin 2026","jeudi 24 juin 2027","samedi 24 juin 2028","dimanche 24 juin 2029","lundi 24 juin 2030","mardi 24 juin 2031","jeudi 24 juin 2032","vendredi 24 juin 2033","samedi 24 juin 2034","dimanche 24 juin 2035","mardi 24 juin 2036","mercredi 24 juin 2037","jeudi 24 juin 2038","vendredi 24 juin 2039","dimanche 24 juin 2040","lundi 24 juin 2041","mardi 24 juin 2042","mercredi 24 juin 2043","vendredi 24 juin 2044","samedi 24 juin 2045","dimanche 24 juin 2046"]
[null,null,"Fête du Canada","lundi 1er juillet 2024","mardi 1er juillet 2025","mercredi 1er juillet 2026","jeudi 1er juillet 2027","samedi 1er juillet 2028","dimanche 1er juillet 2029","lundi 1er juillet 2030","mardi 1er juillet 2031","jeudi 1er juillet 2032","vendredi 1er juillet 2033","samedi 1er juillet 2034","dimanche 1er juillet 2035","mardi 1er juillet 2036","mercredi 1er juillet 2037","jeudi 1er juillet 2038","vendredi 1er juillet 2039","dimanche 1er juillet 2040","lundi 1er juillet 2041","mardi 1er juillet 2042","mercredi 1er juillet 2043","vendredi 1er juillet 2044","samedi 1er juillet 2045","dimanche 1er juillet 2046"]
[null,null,"Fête du Travail","lundi 2 septembre 2024","lundi 1er septembre 2025","lundi 7 septembre 2026","lundi 6 septembre 2027","lundi 4 septembre 2028","lundi 3 septembre 2029","lundi 2 septembre 2030","lundi 1er septembre 2031","lundi 6 septembre 2032","lundi 5 septembre 2033","lundi 4 septembre 2034","lundi 3 septembre 2035","lundi 1er septembre 2036","lundi 7 septembre 2037","lundi 6 septembre 2038","lundi 5 septembre 2039","lundi 3 septembre 2040","lundi 2 septembre 2041","lundi 1er septembre 2042","lundi 7 septembre 2043","lundi 5 septembre 2044","lundi 4 septembre 2045","lundi 3 septembre 2046"]
[null,null,"Fête de l'Action de grâces","lundi 14 octobre 2024","lundi 13 octobre 2025","lundi 12 octobre 2026","lundi 11 octobre 2027","lundi 9 octobre 2028","lundi 8 octobre 2029","lundi 14 octobre 2030","lundi 13 octobre 2031","lundi 11 octobre 2032","lundi 10 octobre 2033","lundi 9 octobre 2034","lundi 8 octobre 2035","lundi 13 octobre 2036","lundi 12 octobre 2037","lundi 11 octobre 2038","lundi 10 octobre 2039","lundi 8 octobre 2040","lundi 14 octobre 2041","lundi 13 octobre 2042","lundi 12 octobre 2043","lundi 10 octobre 2044","lundi 9 octobre 2045","lundi 8 octobre 2046"]
[null,null,"Veille de Noël","mardi 24 décembre 2024","mercredi 24 décembre 2025","jeudi 24 décembre 2026","vendredi 24 décembre 2027","dimanche 24 décembre 2028","lundi 24 décembre 2029","mardi 24 décembre 2030","mercredi 24 décembre 2031","vendredi 24 décembre 2032","samedi 24 décembre 2033","dimanche 24 décembre 2034","lundi 24 décembre 2035","mercredi 24 décembre 2036","jeudi 24 décembre 2037","vendredi 24 décembre 2038","samedi 24 décembre 2039","lundi 24 décembre 2040","mardi 24 décembre 2041","mercredi 24 décembre 2042","jeudi 24 décembre 2043","samedi 24 décembre 2044","dimanche 24 décembre 2045","lundi 24 décembre 2046"]
[null,null,"Noël","mercredi 25 décembre 2024","jeudi 25 décembre 2025","vendredi 25 décembre 2026","samedi 25 décembre 2027","lundi 25 décembre 2028","mardi 25 décembre 2029","mercredi 25 décembre 2030","jeudi 25 décembre 2031","samedi 25 décembre 2032","dimanche 25 décembre 2033","lundi 25 décembre 2034","mardi 25 décembre 2035","jeudi 25 décembre 2036","vendredi 25 décembre 2037","samedi 25 décembre 2038","dimanche 25 décembre 2039","mardi 25 décembre 2040","mercredi 25 décembre 2041","jeudi 25 décembre 2042","vendredi 25 décembre 2043","dimanche 25 décembre 2044","lundi 25 décembre 2045","mardi 25 décembre 2046"]
[null,null,"Lendemain de Noël","jeudi 26 décembre 2024","vendredi 26 décembre 2025","samedi 26 décembre 2026","dimanche 26 décembre 2027","mardi 26 décembre 2028","mercredi 26 décembre 2029","jeudi 26 décembre 2030","vendredi 26 décembre 2031","dimanche 26 décembre 2032","lundi 26 décembre 2033","mardi 26 décembre 2034","mercredi 26 décembre 2035","vendredi 26 décembre 2036","samedi 26 décembre 2037","dimanche 26 décembre 2038","lundi 26 décembre 2039","mercredi 26 décembre 2040","jeudi 26 décembre 2041","vendredi 26 décembre 2042","samedi 26 décembre 2043","lundi 26 décembre 2044","mardi 26 décembre 2045","mercredi 26 décembre 2046"]
[null,null,"Veille du Jour de l'An","mardi 31 décembre 2024","mercredi 31 décembre 2025","jeudi 31 décembre 2026","vendredi 31 décembre 2027","dimanche 31 décembre 2028","lundi 31 décembre 2029","mardi 31 décembre 2030","mercredi 31 décembre 2031","vendredi 31 décembre 2032","samedi 31 décembre 2033","dimanche 31 décembre 2034","lundi 31 décembre 2035","mercredi 31 décembre 2036","jeudi 31 décembre 2037","vendredi 31 décembre 2038","samedi 31 décembre 2039","lundi 31 décembre 2040","mardi 31 décembre 2041","mercredi 31 décembre 2042","jeudi 31 décembre 2043","samedi 31 décembre 2044","dimanche 31 décembre 2045","lundi 31 décembre 2046"]
[]
[null,"Mis à jour par le Bureau du coroner en novembre 2025"]
[null,"Les années bissextiles"]

{"sheet":"Attente","index":6,"n_rows":50,"n_cols":10,"rows_kept":50,"cut":false,"hidden":true,"merged":[[50,1,55,9],[46,1,47,9],[44,1,44,9],[16,3,16,5],[25,3,25,5],[17,9,19,9],[26,9,28,9],[34,3,34,5],[35,9,37,9]]}
[]
[]
[null,null,null,null,null,null,null,null,null,{"$f":"Général!L3","v":0}]
[]
[]
[null,"Remplir les cellules jaunes seulement, au besoin."]
[null,"Utilisez le format aaaa-mm-jj pour les dates."]
[null,"   Exemple: 4 mars 2021: inscrivez 2021-03-04"]
[null,"Utilisez le format 24 heures."]
[null,"  Exemple: 8 h 30 le matin: inscrivez 8:30 Pour minuit et 10 minutes inscrivez 0:10"]
[]
[]
[]
[null,null,null,"Début",null,"Fin",null,"Heure de fin modifiée*",null,"Coûts remboursables"]
[]
[]
[null,"Lieu de l'attente 1:"]
[null,null,null,null,null,null,null,null,null,{"$f":"IF(OR(D21=\"\",F21=\"\"),\"Les heures doivent être inscrites\",\"\")","v":"Les heures doivent être inscrites"}]
[null,"Date:"]
[]
[null,"Heure:",null,null,null,null,null,{"$f":"IFERROR(IF('Calculs temps attente'!C16='Calculs temps attente'!C15,\"\",'Calculs temps attente'!C16),)","v":"00:00:00"},null,{"$f":"IFERROR(IF(OR(D21=\"\",F21=\"\"),\"\",'Calculs temps attente'!H40),0)","v":""}]
[]
[]
[]
[]
[null,"Lieu de l'attente 2:"]
[null,null,null,null,null,null,null,null,null,{"$f":"IF(OR(D30=\"\",F30=\"\"),\"Les heures doivent être inscrites\",\"\")","v":"Les heures doivent être inscrites"}]
[null,"Date:"]
[]
[null,"Heure:",null,null,null,null,null,{"$f":"IFERROR(IF('Calculs temps attente'!C47='Calculs temps attente'!C46,\"\",'Calculs temps attente'!C47),)","v":"00:00:00"},null,{"$f":"IFERROR(IF(OR(D30=\"\",F30=\"\"),\"\",'Calculs temps attente'!H71),0)","v":""}]
[]
[]
[]
[]
[null,"Lieu de l'attente 3:"]
[null,null,null,null,null,null,null,null,null,{"$f":"IF(OR(D39=\"\",F39=\"\"),\"Les heures doivent être inscrites\",\"\")","v":"Les heures doivent être inscrites"}]
[null,"Date:"]
[]
[null,"Heure:",null,null,null,null,null,{"$f":"IFERROR(IF('Calculs temps attente'!C78='Calculs temps attente'!C77,\"\",'Calculs temps attente'!C78),)","v":"00:00:00"},null,{"$f":"IFERROR(IF(OR(D39=\"\",F39=\"\"),\"\",'Calculs temps attente'!H102),0)","v":""}]
[]
[]
[]
[null,null,null,null,null,null,null,"Total",null,{"$f":"SUM(J21:J42)","v":0}]
[]
[null,"* Si le temps d'attente dépasse une durée de 9 h, l'heure de fin de l'attente est modifiée automatiquement pour tenir compte de ce maximum."]
[]
[null,"Si aucun total ne s'inscrit à droite ou que la cellule indique ####, \nmodifier les dates et/ou les heures ou le format des dates et/ou des heures."]
[]
[]
[null,"Commentaires:"]

{"sheet":"Assistance","index":7,"n_rows":32,"n_cols":10,"rows_kept":32,"cut":false,"hidden":true,"merged":[[15,3,15,5],[28,1,29,9],[32,1,37,9],[17,3,17,5],[20,9,22,9]]}
[]
[]
[null,null,null,null,null,null,null,null,null,{"$f":"Général!L3","v":0}]
[]
[]
[null,"Remplir les cellules jaunes seulement, au besoin."]
[null,"Utilisez le format aaaa-mm-jj pour les dates."]
[null,"   Exemple: 4 mars 2021: inscrivez 2021-03-04"]
[null,"Utilisez le format 24 heures."]
[null,"  Exemple: 8 h 30 le matin: inscrivez 8:30 Pour minuit et 10 minutes inscrivez 0:10"]
[]
[]
[]
[]
[]
[null,"Lieu d'assistance:"]
[]
[null,"Nom du préposé:"]
[]
[null,null,null,"Début",null,"Fin"]
[null,"Date:",null,null,null,null,null,null,null,{"$f":"IF(OR(D23=\"\",F23=\"\"),\"Les heures doivent être inscrites\",\"\")","v":"Les heures doivent être inscrites"}]
[]
[null,"Heure:"]
[null,null,null,null,null,null,null,null,null,"Coûts remboursables"]
[]
[null,null,null,null,null,null,null,"Total",null,{"$f":"'Calculs temps attente'!H133","v":{"$error":"#N/A"}}]
[]
[]
[null,"Si aucun total ne s'inscrit à droite ou que la cellule indique ####, \nmodifier les dates et/ou les heures ou le format des dates et/ou des heures."]
[]
[]
[null,"Commentaires:"]

{"sheet":"Calculs temps attente","index":8,"n_rows":133,"n_cols":16,"rows_kept":133,"cut":false,"hidden":true,"merged":[[112,9,112,10],[112,11,112,12],[81,9,81,10],[81,11,81,12],[6,19,6,20],[19,9,19,10],[19,11,19,12],[50,9,50,10],[50,11,50,12]]}
[null,null,"TEMPS D'ATTENTE"]
[]
[null,null,"Semaine / Jour_soir",{"$f":"TAUX!$C6","v":29.25},null,null,"NE RIEN MODIFIER DANS CE TABLEAU SOUS PEINE D'ÉLECTROCUTION"]
[null,null,"Semaine / Nuit",{"$f":"TAUX!$C7","v":36.25}]
["00:00:00",null,"Fin de semaine / Jour_soir",{"$f":"TAUX!$C8","v":32.5}]
["23:59:00",null,"Fin de semaine / Nuit",{"$f":"TAUX!$C9","v":39.25}]
[{"$f":"TEXT(A6,\"hh:mm\")","v":"23:59"},null,"Férié / Jour_soir",{"$f":"TAUX!$C10","v":40.75}]
[{"$f":"TEXT(A9,\"hh:mm\")","v":"08:00"},null,"Férié / Nuit",{"$f":"TAUX!$C11","v":49}]
["08:00:00"]
[1]
[null,null,null,null,null,null,"Attente 1"]
[]
[null,"Début","Fin"]
["Date début /  fin",{"$f":"Attente!D19","v":"00:00:00"},{"$f":"Attente!F19","v":"00:00:00"},{"$f":"TEXT(B14,\"aaaa-mm-jj \")&TEXT(B15,\"hh:mm\")","v":"1900-01-00 00:00"}]
["Heure début / fin",{"$f":"Attente!D21","v":"00:00:00"},{"$f":"TEXT(Attente!F21,\"hh:mm\")","v":"00:00"},{"$f":"TEXT(C14,\"aaaa-mm-jj \")&TEXT(C15,\"hh:mm\")","v":"1900-01-00 00:00"},null,{"$f":"IF(AND(B16>A8,B16<A7),B16,\"\")","v":""}]
["Heure modifiée",{"$f":"TEXT(B15,\"hh:mm\")","v":"00:00"},{"$f":"TEXT(IF(D16<K30,C15,B16+K30),\"hh:mm\")","v":{"$error":"#VALUE!"}},{"$f":"D15-D14","v":{"$error":"#VALUE!"}}]
[]
[]
[]
[null,null,null,null,{"$f":"IF(E22>=K30,\"Dépassement\",\"\")","v":"Dépassement"},null,{"$f":"IFERROR(IF(AND(B25=\"oui\",D15<K30),$A$10-C25,$A$10-C25),\"\")","v":""},{"$f":"TEXT(IFERROR(IF(AND(C16>$A$8,B25=\"oui\"),\n$A$8,E25-G25),\"\"),\"hh:mm\")","v":""},{"$f":"IFERROR(IF(AND(E25-G20-H20>0,B25=\"oui\"),IF(C16-$A$8>0,C16-$A$8,\"\")),)","v":"00:00:00"},"Semaine  ou FDS",null,"Férié ou ordinaire"]
[null,null,"Début","Fin","Durée totale",null,"Durée jour 1","Durée nuit","Durée jour 2","Jour 1","Jour 2","Jour 1","Jour 2"]
["Jour + Jour",{"$f":"IF(C14-B14=0,\n\"oui\",IF(AND(C14-B14=1,B16+K30<=A10),\n\"oui\",\n\"non\"))","v":"oui"},{"$f":"IF(AND(B16>=$A$8,\nB16<=$A$7,\nB22=\"oui\"),\nB16,\"\")","v":""},{"$f":"IF(C22<>\"\",C16,\"\")","v":""},{"$f":"IF(AND(D22=\"\",C22=\"\"),\"\",IF(D22=\"00:00\",A10-B16,D22-C22))","v":""},null,{"$f":"$E22","v":""},null,null,{"$f":"IFERROR(IF(VLOOKUP(B14,'Jours fériés'!$B$4:$E$5000,2,FALSE)=\"s\",\"S\",\"FDS\"),0)","v":0},null,{"$f":"IF(VLOOKUP(B14,'Jours fériés'!$B$4:$E$5000,3,FALSE)=\"Oui\",\"F\",\"\")","v":{"$error":"#N/A"}}]
["Nuit+ Nuit",{"$f":"IF(C14-B14=0,\"oui\",\"non\")","v":"oui"},{"$f":"IF(AND(B16>=$A$5,\nC16<=$A$8,\nB23=\"oui\"),\nB16,\"\")","v":{"$error":"#VALUE!"}},{"$f":"IF(C23<>\"\",C16,\"\")","v":{"$error":"#VALUE!"}},{"$f":"TEXT(IF(D23<>\"\",D23-C23,\"\"),\"hh:mm\")","v":{"$error":"#VALUE!"}},null,null,{"$f":"TEXT($E23,\"hh:mm\")","v":{"$error":"#VALUE!"}},null,{"$f":"IF(VLOOKUP(B14,'Jours fériés'!B4:$E$5000,2,FALSE)=\"s\",\"S\",\"FDS\")","v":{"$error":"#N/A"}},null,{"$f":"IF(VLOOKUP(B14,'Jours fériés'!$B$4:$E$5000,3,FALSE)=\"Oui\",\"F\",\"\")","v":{"$error":"#N/A"}}]
["Nuit + Jour",{"$f":"IF(C14-B14=0,\"oui\",\"non\")","v":"oui"},{"$f":"IF(AND(B16>=$A$5,\nB16<A8,\nC16>$A$8,\nB24=\"oui\"),\nB16,\"\")","v":{"$error":"#VALUE!"}},{"$f":"IF(C24<>\"\",C16,\"\")","v":{"$error":"#VALUE!"}},{"$f":"TEXT(IF(D24<>\"\",D24-C24,\"\"),\"hh:mm\")","v":{"$error":"#VALUE!"}},null,null,{"$f":"TEXT(IF(D24<>\"\",$A$8-C24,\"\"),\"hh:mm\")","v":{"$error":"#VALUE!"}},{"$f":"IF(E24<>\"\",D24-$A$8,\"\")","v":{"$error":"#VALUE!"}},{"$f":"IF(VLOOKUP(B14,'Jours fériés'!$B$4:$E$5000,2,FALSE)=\"s\",\"S\",\"FDS\")","v":{"$error":"#N/A"}},{"$f":"IF(VLOOKUP(C14,'Jours fériés'!$B$4:$E$5000,2,FALSE)=\"s\",\"S\",\"FDS\")","v":{"$error":"#N/A"}},{"$f":"IF(VLOOKUP(B14,'Jours fériés'!$B$4:$E$5000,3,FALSE)=\"Oui\",\"F\",\"\")","v":{"$error":"#N/A"}},{"$f":"IF(VLOOKUP(C14,'Jours fériés'!$B$4:$E$5000,3,FALSE)=\"Oui\",\"F\",\"\")","v":{"$error":"#N/A"}}]
["Jour + Nuit",{"$f":"IF(AND(C14-B14=1,B16+K30<=A10),\n\"non\",IF(\nC14-B14=1,\"oui\",\"non\"))","v":"non"},{"$f":"IF(B25=\"oui\",B15,\"\")","v":""},{"$f":"IF(C25<>\"\",C16,\"\")","v":""},{"$f":"IF(D25<>\"\",($A$10-C25)+D25,\"\")","v":""},null,{"$f":"IF(G20=\"\",\"\",G20)","v":""},{"$f":"TEXT(IFERROR(IF(H20=\"\",\"\",H20),\"\"),\"hh:mm\")","v":""},{"$f":"IFERROR(IF(I20=\"\",\"\",I20),\"\")","v":"00:00:00"},{"$f":"IF(VLOOKUP(B14,'Jours fériés'!$B$4:$E$5000,2,FALSE)=\"s\",\"S\",\"FDS\")","v":{"$error":"#N/A"}},{"$f":"IF(VLOOKUP(C14,'Jours fériés'!$B$4:$E$5000,2,FALSE)=\"s\",\"S\",\"FDS\")","v":{"$error":"#N/A"}},{"$f":"IF(VLOOKUP(B14,'Jours fériés'!$B$4:$E$5000,3,FALSE)=\"Oui\",\"F\",\"\")","v":{"$error":"#N/A"}},{"$f":"IF(VLOOKUP(C14,'Jours fériés'!$B$4:$E$5000,3,FALSE)=\"Oui\",\"F\",\"\")","v":{"$error":"#N/A"}}]
[null,null,{"$f":"C25","v":""},{"$f":"D25","v":""},{"$f":"SUM(E22:E25)","v":{"$error":"#VALUE!"}},null,{"$f":"TEXT(IF(L33=TRUE,SUM(G22:G25),\"\"),\"hh:mm\")","v":""},{"$f":"TEXT(IF(H23<>\"\",H23,IF(H24<>\"\",H24,IF(H25<>\"\",H25,\"\"))),\"hh:mm\")","v":{"$error":"#VALUE!"}},{"$f":"TEXT(IF(L35=TRUE,SUM(I22:I25),\"\"),\"hh:mm\")","v":{"$error":"#VALUE!"}}]
[]
[]
[]
[null,"JOUR","NUIT","Taux","en centièmes X 1","Heures X 2 ou X 3","en centièmes X 2 ou X 3","TOTAL",null,null,"09:00:00",null,"09:00:00","18:00:00"]
["Semaine jour 1",{"$f":"TEXT(IF(AND(G26<>\"\",J25=\"S\",L25<>\"F\"),G26,\"0\"),\"hh:mm\")","v":{"$error":"#N/A"}},null,{"$f":"$D$3","v":29.25},{"$f":"IF(AND(B31<>$A$5,B31<>\"\"),ROUND(B31*24,2),)","v":{"$error":"#N/A"}},{"$f":"B31*'Calculs choix indemnité'!$F$17","v":{"$error":"#N/A"}},{"$f":"ROUND(IF($N$33=2,VLOOKUP(E31,équivalencev2,2,FALSE),IF($N$33=3,VLOOKUP(E31,équivalencev2,3,FALSE),VLOOKUP(E31,équivalencev2,1,FALSE))),2)","v":{"$error":"#N/A"}},{"$f":"IF($N$33=1,E31*D31,IF($N$33=2,G31*D31,IF($N$33=3,G31*D31,)))","v":0},null,null,null,null,"09:00:00","18:00:00",null,{"$f":"LEFT(O31,2)","v":""}]
["Semaine jour 2",{"$f":"TEXT(IF(AND(I26<>\"\",K25=\"S\",M25<>\"F\"),I26,\"0\"),\"hh:mm\")","v":{"$error":"#VALUE!"}},null,{"$f":"$D$3","v":29.25},{"$error":"#VALUE!"},{"$f":"B32*'Calculs choix indemnité'!$F$17","v":{"$error":"#VALUE!"}},{"$f":"ROUND(IF($N$33=2,VLOOKUP(E32,équivalencev2,2,FALSE),IF($N$33=3,VLOOKUP(E32,équivalencev2,3,FALSE),VLOOKUP(E32,équivalencev2,1,FALSE))),2)","v":{"$error":"#VALUE!"}},{"$f":"IF($N$33=1,E32*D32,IF($N$33=2,G32*D32,IF($N$33=3,G32*D32,)))","v":0},null,null,"Tableau Total en orange:",{"$f":"OR($H31<>\"\",$H32<>\"\",$H33<>\"\",$H34<>\"\",$H35<>\"\",$H36<>\"\",$H37<>\"\",$H38<>\"\",$H39<>\"\")","v":true},null,null,null,{"$f":"RIGHT(O31,2)","v":""}]
["Fin de semaine jour 1",{"$f":"TEXT(IF(AND(G26<>\"\",J25=\"fds\",L25<>\"F\"),G26,\"0\"),\"hh:mm\")","v":{"$error":"#N/A"}},null,{"$f":"$D$5","v":32.5},{"$error":"#N/A"},{"$f":"B33*'Calculs choix indemnité'!$F$17","v":{"$error":"#N/A"}},{"$f":"ROUND(IF($N$33=2,VLOOKUP(E33,équivalencev2,2,FALSE),IF($N$33=3,VLOOKUP(E33,équivalencev2,3,FALSE),VLOOKUP(E33,équivalencev2,1,FALSE))),2)","v":{"$error":"#N/A"}},0,null,null,"Tableau durée jour:",{"$f":"OR($G22<>\"\",$G24<>\"\",$G25<>\"\")","v":false},"nbre préposés",{"$f":"'Calculs choix indemnité'!F17","v":0}]
["Fin de semaine jour 2",{"$f":"TEXT(IF(AND(I26<>\"\",K25=\"fds\",M25<>\"F\"),I26,\"0\"),\"hh:mm\")","v":{"$error":"#VALUE!"}},null,{"$f":"$D$5","v":32.5},{"$error":"#VALUE!"},{"$f":"B34*'Calculs choix indemnité'!$F$17","v":{"$error":"#VALUE!"}},{"$f":"ROUND(IF($N$33=2,VLOOKUP(E34,équivalencev2,2,FALSE),IF($N$33=3,VLOOKUP(E34,équivalencev2,3,FALSE),VLOOKUP(E34,équivalencev2,1,FALSE))),2)","v":{"$error":"#VALUE!"}},0,null,null,"Tableau durée nuit:",{"$f":"OR($H22<>\"\",$H23<>\"\",$H24<>\"\",$H25<>\"\")","v":{"$error":"#VALUE!"}}]
["Férié jour 1",{"$f":"TEXT(IF(AND(G26<>\"\",L25=\"F\"),G26,\"0\"),\"hh:mm\")","v":{"$error":"#N/A"}},null,{"$f":"$D$7","v":40.75},{"$error":"#N/A"},{"$f":"B35*'Calculs choix indemnité'!$F$17","v":{"$error":"#N/A"}},{"$f":"ROUND(IF($N$33=2,VLOOKUP(E35,équivalencev2,2,FALSE),IF($N$33=3,VLOOKUP(E35,équivalencev2,3,FALSE),VLOOKUP(E35,équivalencev2,1,FALSE))),2)","v":{"$error":"#N/A"}},0,null,null,"Tableau durée jour 2:",{"$f":"OR(I23<>\"\",I24<>\"\",I25<>\"\")","v":{"$error":"#VALUE!"}}]
["Férie jour 2",{"$f":"TEXT(IF(AND(I26<>\"\",M25=\"F\"),I26,\"0\"),\"hh:mm\")","v":{"$error":"#VALUE!"}},null,{"$f":"$D$7","v":40.75},{"$error":"#VALUE!"},{"$f":"B36*'Calculs choix indemnité'!$F$17","v":{"$error":"#VALUE!"}},{"$f":"ROUND(IF($N$33=2,VLOOKUP(E36,équivalencev2,2,FALSE),IF($N$33=3,VLOOKUP(E36,équivalencev2,3,FALSE),VLOOKUP(E36,équivalencev2,1,FALSE))),2)","v":{"$error":"#VALUE!"}},0]
["Semaine nuit",null,{"$f":"TEXT(IF(AND(H26<>\"\",K25=\"S\",M25<>\"F\"),H26+0,\"0\"),\"hh:mm\")","v":{"$error":"#VALUE!"}},{"$f":"$D$4","v":36.25},{"$f":"IF(C37<>\"\",ROUND(C37*24,2),\"0\")","v":{"$error":"#VALUE!"}},{"$f":"C37*'Calculs choix indemnité'!$F$17","v":{"$error":"#VALUE!"}},{"$f":"ROUND(IF($N$33=2,VLOOKUP(E37,équivalencev2,2,FALSE),IF($N$33=3,VLOOKUP(E37,équivalencev2,3,FALSE),VLOOKUP(E37,équivalencev2,1,FALSE))),2)","v":{"$error":"#VALUE!"}},0]
["Fin de semaine nuit",null,{"$f":"TEXT(IF(AND(H26<>\"\",K25=\"FDS\",M25<>\"F\"),H26+0,\"0\"),\"hh:mm\")","v":{"$error":"#VALUE!"}},{"$f":"$D$6","v":39.25},{"$f":"IF(C38<>\"\",ROUND(C38*24,2),\"0\")","v":{"$error":"#VALUE!"}},{"$f":"C38*'Calculs choix indemnité'!$F$17","v":{"$error":"#VALUE!"}},{"$f":"ROUND(IF($N$33=2,VLOOKUP(E38,équivalencev2,2,FALSE),IF($N$33=3,VLOOKUP(E38,équivalencev2,3,FALSE),VLOOKUP(E38,équivalencev2,1,FALSE))),2)","v":{"$error":"#VALUE!"}},0]
["Férié nuit",null,{"$f":"TEXT(IF(AND(H26<>\"\",M25=\"F\"),H26+0,\"0\"),\"hh:mm\")","v":{"$error":"#VALUE!"}},{"$f":"$D$8","v":49},{"$f":"IF(C39<>\"\",ROUND(C39*24,2),\"0\")","v":{"$error":"#VALUE!"}},{"$f":"C39*'Calculs choix indemnité'!$F$17","v":{"$error":"#VALUE!"}},{"$f":"ROUND(IF($N$33=2,VLOOKUP(E39,équivalencev2,2,FALSE),IF($N$33=3,VLOOKUP(E39,équivalencev2,3,FALSE),VLOOKUP(E39,équivalencev2,1,FALSE))),2)","v":{"$error":"#VALUE!"}},0,null,{"$f":"E39","v":{"$error":"#VALUE!"}}]
[null,null,null,null,{"$f":"SUM(E31:E39)","v":{"$error":"#N/A"}},{"$f":"SUM(F31:F39)","v":{"$error":"#N/A"}},{"$f":"SUM(G31:G39)","v":{"$error":"#N/A"}},{"$f":"SUM($H31:$H39)","v":0}]
[null,null,null,null,{"$f":"IFERROR(E33,\"non\")","v":"non"}]
[]
[]
[null,"Début","Fin",null,null,null,"Attente 2"]
["Date début /  fin",{"$f":"Attente!D28","v":"00:00:00"},{"$f":"Attente!F28","v":"00:00:00"},{"$f":"TEXT(B45,\"aaaa-mm-jj \")&TEXT(B46,\"hh:mm\")","v":"1900-01-00 00:00"}]
["Heure début / fin",{"$f":"TEXT(Attente!D30,\"hh:mm\")","v":"00:00"},{"$f":"(TEXT(Attente!F30,\"hh:mm\"))","v":"00:00"},{"$f":"TEXT(C45,\"aaaa-mm-jj \")&TEXT(C46,\"hh:mm\")","v":"1900-01-00 00:00"}]
["Heure modifiée",{"$f":"TEXT(B46,\"hh:mm\")","v":"00:00"},{"$f":"TEXT(IF(D47<K61,C46,B47+K61),\"hh:mm\")","v":{"$error":"#VALUE!"}},{"$f":"D46-D45","v":{"$error":"#VALUE!"}}]
[]
[]
[]
[null,null,null,null,{"$f":"IF(E53>=K61,\"Dépassement\",\"\")","v":"Dépassement"},null,{"$f":"IFERROR(IF(AND(B56=\"oui\",D47<K61),$A$10-C56,$A$10-C56),\"\")","v":""},{"$f":"TEXT(IFERROR(IF(AND(C47>$A$8,B56=\"oui\"),$A$8,E56-G56),\"\"),\"hh:mm\")","v":""},{"$f":"IFERROR(IF(AND(E56-G51-H51>0,B56=\"oui\"),IF(C47-$A$8>0,C47-$A$8,\"\")),)","v":"00:00:00"},"Semaine  ou FDS",null,"Férié ou ordinaire"]
[null,null,"Début","Fin","Durée totale",null,"Durée jour 1","Durée nuit","Durée jour 2","Jour 1","Jour 2","Jour 1","Jour 2"]
["Jour + Jour",{"$f":"IF(C45-B45=0,\n\"oui\",IF(AND(C45-B45=1,B47+K30<=A10),\n\"oui\",\n\"non\"))","v":"oui"},{"$f":"IF(AND(B47>=$A$8,\nB47<=$A$7,\nB53=\"oui\"),\nB47,\"\")","v":""},{"$f":"IF(C53<>\"\",C47,\"\")","v":""},{"$f":"IF(AND(D53=\"\",C53=\"\"),\"\",IF(D53=\"00:00\",A10-B47,D53-C53))","v":""},null,{"$f":"$E53","v":""},null,null,{"$f":"IFERROR(IF(VLOOKUP(B45,'Jours fériés'!$B$4:$E$5000,2,FALSE)=\"s\",\"S\",\"FDS\"),0)","v":0},null,{"$f":"IF(VLOOKUP(B45,'Jours fériés'!$B$4:$E$5000,3,FALSE)=\"Oui\",\"F\",\"\")","v":{"$error":"#N/A"}}]
["Nuit+ Nuit",{"$f":"IF(C45-B45=0,\"oui\",\"non\")","v":"oui"},{"$f":"IF(AND(B47>=$A$5,\nC47<=$A$8,\nB54=\"oui\"),\nB47,\"\")","v":{"$error":"#VALUE!"}},{"$f":"IF(C54<>\"\",C47,\"\")","v":{"$error":"#VALUE!"}},{"$f":"TEXT(IF(D54<>\"\",D54-C54,\"\"),\"hh:mm\")","v":{"$error":"#VALUE!"}},null,null,{"$f":"TEXT($E54,\"hh:mm\")","v":{"$error":"#VALUE!"}},null,{"$f":"IF(VLOOKUP(B45,'Jours fériés'!B32:$E$5000,2,FALSE)=\"s\",\"S\",\"FDS\")","v":{"$error":"#N/A"}},null,{"$f":"IF(VLOOKUP(B45,'Jours fériés'!$B$4:$E$5000,3,FALSE)=\"Oui\",\"F\",\"\")","v":{"$error":"#N/A"}}]
["Nuit + Jour",{"$f":"IF(C45-B45=0,\"oui\",\"non\")","v":"oui"},{"$f":"IF(AND(B47>$A$5,\nC47>$A$8,\nB47<A8,\nB55=\"oui\"),\nB47,\"\")","v":{"$error":"#VALUE!"}},{"$f":"IF(C55<>\"\",C47,\"\")","v":{"$error":"#VALUE!"}},{"$f":"TEXT(IF(D55<>\"\",D55-C55,\"\"),\"hh:mm\")","v":{"$error":"#VALUE!"}},null,null,{"$f":"TEXT(IF(D55<>\"\",$A$8-C55,\"\"),\"hh:mm\")","v":{"$error":"#VALUE!"}},{"$f":"IF(E55<>\"\",D55-$A$8,\"\")","v":{"$error":"#VALUE!"}},{"$f":"IF(VLOOKUP(B45,'Jours fériés'!$B$4:$E$5000,2,FALSE)=\"s\",\"S\",\"FDS\")","v":{"$error":"#N/A"}},{"$f":"IF(VLOOKUP(C45,'Jours fériés'!$B$4:$E$5000,2,FALSE)=\"s\",\"S\",\"FDS\")","v":{"$error":"#N/A"}},{"$f":"IF(VLOOKUP(B45,'Jours fériés'!$B$4:$E$5000,3,FALSE)=\"Oui\",\"F\",\"\")","v":{"$error":"#N/A"}},{"$f":"IF(VLOOKUP(C45,'Jours fériés'!$B$4:$E$5000,3,FALSE)=\"Oui\",\"F\",\"\")","v":{"$error":"#N/A"}}]
["Jour + Nuit",{"$f":"IF(AND(C45-B45=1,B47+K30<=A10),\n\"non\",\nIF(C45-B45=1,\"oui\",\"non\"))","v":"non"},{"$f":"IF(B56=\"oui\",B46,\"\")","v":""},{"$f":"IF(C56<>\"\",C47,\"\")","v":""},{"$f":"IF(D56<>\"\",($A$10-C56)+D56,\"\")","v":""},null,{"$f":"IF(G51=\"\",\"\",G51)","v":""},{"$f":"TEXT(IFERROR(IF(H51=\"\",\"\",H51),\"\"),\"hh:mm\")","v":""},{"$f":"IFERROR(IF(I51=\"\",\"\",I51),\"\")","v":"00:00:00"},{"$f":"IF(VLOOKUP(B45,'Jours fériés'!$B$4:$E$5000,2,FALSE)=\"s\",\"S\",\"FDS\")","v":{"$error":"#N/A"}},{"$f":"IF(VLOOKUP(C45,'Jours fériés'!$B$4:$E$5000,2,FALSE)=\"s\",\"S\",\"FDS\")","v":{"$error":"#N/A"}},{"$f":"IF(VLOOKUP(B45,'Jours fériés'!$B$4:$E$5000,3,FALSE)=\"Oui\",\"F\",\"\")","v":{"$error":"#N/A"}},{"$f":"IF(VLOOKUP(C45,'Jours fériés'!$B$4:$E$5000,3,FALSE)=\"Oui\",\"F\",\"\")","v":{"$error":"#N/A"}}]
[null,null,{"$f":"C56","v":""},{"$f":"D56","v":""},{"$f":"SUM(E53:E56)","v":{"$error":"#VALUE!"}},null,{"$f":"TEXT(IF(L64=TRUE,SUM(G53:G56),\"\"),\"hh:mm\")","v":""},{"$f":"IF(H54<>\"\",H54,IF(H55<>\"\",H55,IF(H56<>\"\",H56,\"\")))","v":{"$error":"#VALUE!"}},{"$f":"TEXT(IF(L66=TRUE,SUM(I53:I56),\"\"),\"hh:mm\")","v":{"$error":"#VALUE!"}}]
[]
[]
[]
[null,"JOUR","NUIT","Taux","en centièmes X 1","Heures X 2 ou X 3","en centièmes X 2 ou X 3","TOTAL",null,null,"09:00:00",null,"09:00:00","18:00:00"]
["Semaine jour 1",{"$f":"TEXT(IF(AND(G57<>\"\",J56=\"S\",L56<>\"F\"),G57,\"0\"),\"hh:mm\")","v":{"$error":"#N/A"}},null,{"$f":"$D$3","v":29.25},{"$f":"IF(AND(B62<>$A$5,B62<>\"\"),ROUND(B62*24,2),)","v":{"$error":"#N/A"}},{"$f":"B62*'Calculs choix indemnité'!$F$17","v":{"$error":"#N/A"}},{"$f":"ROUND(IF($N$33=2,VLOOKUP(E62,équivalencev2,2,FALSE),IF($N$33=3,VLOOKUP(E62,équivalencev2,3,FALSE),VLOOKUP(E62,équivalencev2,1,FALSE))),2)","v":{"$error":"#N/A"}},{"$f":"IF($N$33=1,E62*D62,IF($N$33=2,G62*D62,IF($N$33=3,G62*D62,)))","v":0},null,null,null,null,"09:00:00","18:00:00"]
["Semaine jour 2",{"$f":"TEXT(IF(AND(I57<>\"\",K56=\"S\",M56<>\"F\"),I57,\"0\"),\"hh:mm\")","v":{"$error":"#VALUE!"}},null,{"$f":"$D$3","v":29.25},{"$error":"#VALUE!"},{"$f":"B63*'Calculs choix indemnité'!$F$17","v":{"$error":"#VALUE!"}},{"$f":"ROUND(IF($N$33=2,VLOOKUP(E63,équivalencev2,2,FALSE),IF($N$33=3,VLOOKUP(E63,équivalencev2,3,FALSE),VLOOKUP(E63,équivalencev2,1,FALSE))),2)","v":{"$error":"#VALUE!"}},{"$f":"IF($N$33=1,E63*D63,IF($N$33=2,G63*D63,IF($N$33=3,G63*D63,)))","v":0},null,null,"Tableau Total en orange:",{"$f":"OR($H62<>\"\",$H63<>\"\",$H64<>\"\",$H65<>\"\",$H66<>\"\",$H67<>\"\",$H68<>\"\",$H69<>\"\",$H70<>\"\")","v":true}]
["Fin de semaine jour 1",{"$f":"TEXT(IF(AND(G57<>\"\",J56=\"fds\",L56<>\"F\"),G57,\"0\"),\"hh:mm\")","v":{"$error":"#N/A"}},null,{"$f":"$D$5","v":32.5},{"$error":"#N/A"},{"$f":"B64*'Calculs choix indemnité'!$F$17","v":{"$error":"#N/A"}},{"$f":"ROUND(IF($N$33=2,VLOOKUP(E64,équivalencev2,2,FALSE),IF($N$33=3,VLOOKUP(E64,équivalencev2,3,FALSE),VLOOKUP(E64,équivalencev2,1,FALSE))),2)","v":{"$error":"#N/A"}},0,null,null,"Tableau durée jour:",{"$f":"OR($G53<>\"\",$G55<>\"\",$G56<>\"\")","v":false},"nbre préposés",{"$f":"'Calculs choix indemnité'!F17","v":0}]
["Fin de semaine jour 2",{"$f":"TEXT(IF(AND(I57<>\"\",K56=\"fds\",M56<>\"F\"),I57,\"0\"),\"hh:mm\")","v":{"$error":"#VALUE!"}},null,{"$f":"$D$5","v":32.5},{"$error":"#VALUE!"},{"$f":"B65*'Calculs choix indemnité'!$F$17","v":{"$error":"#VALUE!"}},{"$f":"ROUND(IF($N$33=2,VLOOKUP(E65,équivalencev2,2,FALSE),IF($N$33=3,VLOOKUP(E65,équivalencev2,3,FALSE),VLOOKUP(E65,équivalencev2,1,FALSE))),2)","v":{"$error":"#VALUE!"}},0,null,null,"Tableau durée nuit:",{"$f":"OR($H53<>\"\",$H54<>\"\",$H55<>\"\",$H56<>\"\")","v":{"$error":"#VALUE!"}}]
["Férié jour 1",{"$f":"TEXT(IF(AND(G57<>\"\",L56=\"F\"),G57,\"0\"),\"hh:mm\")","v":{"$error":"#N/A"}},null,{"$f":"$D$7","v":40.75},{"$error":"#N/A"},{"$f":"B66*'Calculs choix indemnité'!$F$17","v":{"$error":"#N/A"}},{"$error":"#N/A"},0,null,null,"Tableau durée jour 2:",{"$f":"OR(I54<>\"\",I55<>\"\",I56<>\"\")","v":{"$error":"#VALUE!"}}]
["Férie jour 2",{"$f":"TEXT(IF(AND(I57<>\"\",M56=\"F\"),I57,\"0\"),\"hh:mm\")","v":{"$error":"#VALUE!"}},null,{"$f":"$D$7","v":40.75},{"$error":"#VALUE!"},{"$f":"B67*'Calculs choix indemnité'!$F$17","v":{"$error":"#VALUE!"}},{"$error":"#VALUE!"},0]
["Semaine nuit",null,{"$f":"TEXT(IF(AND(H57<>\"\",K56=\"S\",M56<>\"F\"),H57+0,\"0\"),\"hh:mm\")","v":{"$error":"#VALUE!"}},{"$f":"$D$4","v":36.25},{"$f":"IF(C68<>\"\",ROUND(C68*24,2),\"0\")","v":{"$error":"#VALUE!"}},{"$f":"C68*'Calculs choix indemnité'!$F$17","v":{"$error":"#VALUE!"}},{"$error":"#VALUE!"},0]
["Fin de semaine nuit",null,{"$f":"TEXT(IF(AND(H57<>\"\",K56=\"FDS\",M56<>\"F\"),H57+0,\"0\"),\"hh:mm\")","v":{"$error":"#VALUE!"}},{"$f":"$D$6","v":39.25},{"$f":"IF(C69<>\"\",ROUND(C69*24,2),\"0\")","v":{"$error":"#VALUE!"}},{"$f":"C69*'Calculs choix indemnité'!$F$17","v":{"$error":"#VALUE!"}},{"$error":"#VALUE!"},0]
["Férié nuit",null,{"$f":"TEXT(IF(AND(H57<>\"\",M56=\"F\"),H57+0,\"0\"),\"hh:mm\")","v":{"$error":"#VALUE!"}},{"$f":"$D$8","v":49},{"$f":"IF(C70<>\"\",ROUND(C70*24,2),\"0\")","v":{"$error":"#VALUE!"}},{"$f":"C70*'Calculs choix indemnité'!$F$17","v":{"$error":"#VALUE!"}},{"$error":"#VALUE!"},0]
[null,null,null,"Pour 1 préposé",{"$f":"SUM(E62:E70)","v":{"$error":"#N/A"}},{"$f":"SUM(F62:F70)","v":{"$error":"#N/A"}},{"$f":"SUM(G62:G70)","v":{"$error":"#N/A"}},{"$f":"SUM($H62:$H70)","v":0}]
[]
[]
[]
[null,"Début","Fin",null,null,null,"Attente 3"]
["Date début /  fin",{"$f":"Attente!D37","v":"00:00:00"},{"$f":"Attente!F37","v":"00:00:00"},{"$f":"TEXT(B76,\"aaaa-mm-jj \")&TEXT(B77,\"hh:mm\")","v":"1900-01-00 00:00"}]
["Heure début / fin",{"$f":"TEXT(Attente!D39,\"hh:mm\")","v":"00:00"},{"$f":"(TEXT(Attente!F39,\"hh:mm\"))","v":"00:00"},{"$f":"TEXT(C76,\"aaaa-mm-jj \")&TEXT(C77,\"hh:mm\")","v":"1900-01-00 00:00"}]
["Heure modifiée",{"$f":"TEXT(B77,\"hh:mm\")","v":"00:00"},{"$f":"TEXT(IF(D78<K92,C77,B78+K92),\"hh:mm\")","v":{"$error":"#VALUE!"}},{"$f":"D77-D76","v":{"$error":"#VALUE!"}}]
[]
[]
[]
[null,null,null,null,{"$f":"IF(E84>=K92,\"Dépassement\",\"\")","v":"Dépassement"},null,{"$f":"IFERROR(IF(AND(B87=\"oui\",D78<K92),$A$10-C87,$A$10-C87),\"\")","v":""},{"$f":"TEXT(IFERROR(IF(AND(C78>$A$8,B87=\"oui\"),$A$8,E87-G87),\"\"),\"hh:mm\")","v":""},{"$f":"IFERROR(IF(AND(E87-G82-H82>0,B87=\"oui\"),IF(C78-$A$8>0,C78-$A$8,\"\")),)","v":"00:00:00"},"Semaine  ou FDS",null,"Férié ou ordinaire"]
[null,null,"Début","Fin","Durée totale",null,"Durée jour 1","Durée nuit","Durée jour 2","Jour 1","Jour 2","Jour 1","Jour 2"]
["Jour + Jour",{"$f":"IF(C76-B76=0,\n\"oui\",IF(AND(C76-B76=1,B78+K30<=A10),\n\"oui\",\n\"non\"))","v":"oui"},{"$f":"IF(AND(B78>=$A$8,B78<=$A$7,B84=\"oui\"),B78,\"\")","v":""},{"$f":"IF(C84<>\"\",C78,\"\")","v":""},{"$f":"IF(AND(D84=\"\",C84=\"\"),\"\",IF(D84=\"00:00\",A10-B78,D84-C84))","v":""},null,{"$f":"$E84","v":""},null,null,{"$f":"IFERROR(IF(VLOOKUP(B76,'Jours fériés'!$B$4:$E$5000,2,FALSE)=\"s\",\"S\",\"FDS\"),0)","v":0},null,{"$f":"IF(VLOOKUP(B76,'Jours fériés'!$B$4:$E$5000,3,FALSE)=\"Oui\",\"F\",\"\")","v":{"$error":"#N/A"}}]
["Nuit+ Nuit",{"$f":"IF(C76-B76=0,\"oui\",\"non\")","v":"oui"},{"$f":"IF(AND(B78>=$A$5,C78<=$A$8,B85=\"oui\"),B78,\"\")","v":{"$error":"#VALUE!"}},{"$f":"IF(C85<>\"\",C78,\"\")","v":{"$error":"#VALUE!"}},{"$f":"TEXT(IF(D85<>\"\",D85-C85,\"\"),\"hh:mm\")","v":{"$error":"#VALUE!"}},null,null,{"$f":"TEXT($E85,\"hh:mm\")","v":{"$error":"#VALUE!"}},null,{"$f":"IF(VLOOKUP(B76,'Jours fériés'!B63:$E$5000,2,FALSE)=\"s\",\"S\",\"FDS\")","v":{"$error":"#N/A"}},null,{"$f":"IF(VLOOKUP(B76,'Jours fériés'!$B$4:$E$5000,3,FALSE)=\"Oui\",\"F\",\"\")","v":{"$error":"#N/A"}}]
["Nuit + Jour",{"$f":"IF(C76-B76=0,\"oui\",\"non\")","v":"oui"},{"$f":"IF(AND(B78>$A$5,\nC78>$A$8,\nB78<A8,\nB86=\"oui\"),B78,\"\")","v":{"$error":"#VALUE!"}},{"$f":"IF(C86<>\"\",C78,\"\")","v":{"$error":"#VALUE!"}},{"$f":"TEXT(IF(D86<>\"\",D86-C86,\"\"),\"hh:mm\")","v":{"$error":"#VALUE!"}},null,null,{"$f":"TEXT(IF(D86<>\"\",$A$8-C86,\"\"),\"hh:mm\")","v":{"$error":"#VALUE!"}},{"$f":"IF(E86<>\"\",D86-$A$8,\"\")","v":{"$error":"#VALUE!"}},{"$f":"IF(VLOOKUP(B76,'Jours fériés'!$B$4:$E$5000,2,FALSE)=\"s\",\"S\",\"FDS\")","v":{"$error":"#N/A"}},{"$f":"IF(VLOOKUP(C76,'Jours fériés'!$B$4:$E$5000,2,FALSE)=\"s\",\"S\",\"FDS\")","v":{"$error":"#N/A"}},{"$f":"IF(VLOOKUP(B76,'Jours fériés'!$B$4:$E$5000,3,FALSE)=\"Oui\",\"F\",\"\")","v":{"$error":"#N/A"}},{"$f":"IF(VLOOKUP(C76,'Jours fériés'!$B$4:$E$5000,3,FALSE)=\"Oui\",\"F\",\"\")","v":{"$error":"#N/A"}}]
["Jour + Nuit",{"$f":"IF(AND(C76-B76=1,B78+K30<=A10),\n\"non\",IF(C76-B76=1,\"oui\",\"non\"))","v":"non"},{"$f":"IF(B87=\"oui\",B77,\"\")","v":""},{"$f":"IF(C87<>\"\",C78,\"\")","v":""},{"$f":"IF(D87<>\"\",($A$10-C87)+D87,\"\")","v":""},null,{"$f":"IF(G82=\"\",\"\",G82)","v":""},{"$f":"TEXT(IFERROR(IF(H82=\"\",\"\",H82),\"\"),\"hh:mm\")","v":""},{"$f":"IFERROR(IF(I82=\"\",\"\",I82),\"\")","v":"00:00:00"},{"$f":"IF(VLOOKUP(B76,'Jours fériés'!$B$4:$E$5000,2,FALSE)=\"s\",\"S\",\"FDS\")","v":{"$error":"#N/A"}},{"$f":"IF(VLOOKUP(C76,'Jours fériés'!$B$4:$E$5000,2,FALSE)=\"s\",\"S\",\"FDS\")","v":{"$error":"#N/A"}},{"$f":"IF(VLOOKUP(B76,'Jours fériés'!$B$4:$E$5000,3,FALSE)=\"Oui\",\"F\",\"\")","v":{"$error":"#N/A"}},{"$f":"IF(VLOOKUP(C76,'Jours fériés'!$B$4:$E$5000,3,FALSE)=\"Oui\",\"F\",\"\")","v":{"$error":"#N/A"}}]
[null,null,{"$f":"C87","v":""},{"$f":"D87","v":""},{"$f":"SUM(E84:E87)","v":{"$error":"#VALUE!"}},null,{"$f":"TEXT(IF(L95=TRUE,SUM(G84:G87),\"\"),\"hh:mm\")","v":""},{"$f":"IF(H85<>\"\",H85,IF(H86<>\"\",H86,IF(H87<>\"\",H87,\"\")))","v":{"$error":"#VALUE!"}},{"$f":"TEXT(IF(L97=TRUE,SUM(I84:I87),\"\"),\"hh:mm\")","v":{"$error":"#VALUE!"}}]
[]
[]
[]
[null,"JOUR","NUIT","Taux","en centièmes X 1","Heures X 2 ou X 3","en centièmes X 2 ou X 3","TOTAL",null,null,"09:00:00",null,"09:00:00","18:00:00"]
["Semaine jour 1",{"$f":"TEXT(IF(AND(G88<>\"\",J87=\"S\",L87<>\"F\"),G88,\"0\"),\"hh:mm\")","v":{"$error":"#N/A"}},null,{"$f":"$D$3","v":29.25},{"$f":"IF(AND(B93<>$A$5,B93<>\"\"),ROUND(B93*24,2),)","v":{"$error":"#N/A"}},{"$f":"B93*'Calculs choix indemnité'!$F$17","v":{"$error":"#N/A"}},{"$f":"ROUND(IF($N$33=2,VLOOKUP(E93,équivalencev2,2,FALSE),IF($N$33=3,VLOOKUP(E93,équivalencev2,3,FALSE),VLOOKUP(E93,équivalencev2,1,FALSE))),2)","v":{"$error":"#N/A"}},{"$f":"IF($N$33=1,E93*D93,IF($N$33=2,G93*D93,IF($N$33=3,G93*D93,)))","v":0},null,null,null,null,"09:00:00","18:00:00"]
["Semaine jour 2",{"$f":"TEXT(IF(AND(I88<>\"\",K87=\"S\",M87<>\"F\"),I88,\"0\"),\"hh:mm\")","v":{"$error":"#VALUE!"}},null,{"$f":"$D$3","v":29.25},{"$error":"#VALUE!"},{"$f":"B94*'Calculs choix indemnité'!$F$17","v":{"$error":"#VALUE!"}},{"$f":"ROUND(IF($N$33=2,VLOOKUP(E94,équivalencev2,2,FALSE),IF($N$33=3,VLOOKUP(E94,équivalencev2,3,FALSE),VLOOKUP(E94,équivalencev2,1,FALSE))),2)","v":{"$error":"#VALUE!"}},{"$f":"IF($N$33=1,E94*D94,IF($N$33=2,G94*D94,IF($N$33=3,G94*D94,)))","v":0},null,null,"Tableau Total en orange:",{"$f":"OR($H93<>\"\",$H94<>\"\",$H95<>\"\",$H96<>\"\",$H97<>\"\",$H98<>\"\",$H99<>\"\",$H100<>\"\",$H101<>\"\")","v":true}]
["Fin de semaine jour 1",{"$f":"TEXT(IF(AND(G88<>\"\",J87=\"fds\",L87<>\"F\"),G88,\"0\"),\"hh:mm\")","v":{"$error":"#N/A"}},null,{"$f":"$D$5","v":32.5},{"$error":"#N/A"},{"$f":"B95*'Calculs choix indemnité'!$F$17","v":{"$error":"#N/A"}},{"$f":"ROUND(IF($N$33=2,VLOOKUP(E95,équivalencev2,2,FALSE),IF($N$33=3,VLOOKUP(E95,équivalencev2,3,FALSE),VLOOKUP(E95,équivalencev2,1,FALSE))),2)","v":{"$error":"#N/A"}},0,null,null,"Tableau durée jour:",{"$f":"OR($G84<>\"\",$G86<>\"\",$G87<>\"\")","v":false},"nbre préposés",{"$f":"'Calculs choix indemnité'!F48","v":0}]
["Fin de semaine jour 2",{"$f":"TEXT(IF(AND(I88<>\"\",K87=\"fds\",M87<>\"F\"),I88,\"0\"),\"hh:mm\")","v":{"$error":"#VALUE!"}},null,{"$f":"$D$5","v":32.5},{"$error":"#VALUE!"},{"$f":"B96*'Calculs choix indemnité'!$F$17","v":{"$error":"#VALUE!"}},{"$f":"ROUND(IF($N$33=2,VLOOKUP(E96,équivalencev2,2,FALSE),IF($N$33=3,VLOOKUP(E96,équivalencev2,3,FALSE),VLOOKUP(E96,équivalencev2,1,FALSE))),2)","v":{"$error":"#VALUE!"}},0,null,null,"Tableau durée nuit:",{"$f":"OR($H84<>\"\",$H85<>\"\",$H86<>\"\",$H87<>\"\")","v":{"$error":"#VALUE!"}}]
["Férié jour 1",{"$f":"TEXT(IF(AND(G88<>\"\",L87=\"F\"),G88,\"0\"),\"hh:mm\")","v":{"$error":"#N/A"}},null,{"$f":"$D$7","v":40.75},{"$error":"#N/A"},{"$f":"B97*'Calculs choix indemnité'!$F$17","v":{"$error":"#N/A"}},{"$error":"#N/A"},0,null,null,"Tableau durée jour 2:",{"$f":"OR(I85<>\"\",I86<>\"\",I87<>\"\")","v":{"$error":"#VALUE!"}}]
["Férie jour 2",{"$f":"TEXT(IF(AND(I88<>\"\",M87=\"F\"),I88,\"0\"),\"hh:mm\")","v":{"$error":"#VALUE!"}},null,{"$f":"$D$7","v":40.75},{"$error":"#VALUE!"},{"$f":"B98*'Calculs choix indemnité'!$F$17","v":{"$error":"#VALUE!"}},{"$error":"#VALUE!"},0]
["Semaine nuit",null,{"$f":"TEXT(IF(AND(H88<>\"\",K87=\"S\",M87<>\"F\"),H88+0,\"0\"),\"hh:mm\")","v":{"$error":"#VALUE!"}},{"$f":"$D$4","v":36.25},{"$f":"IF(C99<>\"\",ROUND(C99*24,2),\"0\")","v":{"$error":"#VALUE!"}},{"$f":"C99*'Calculs choix indemnité'!$F$17","v":{"$error":"#VALUE!"}},{"$error":"#VALUE!"},0]
["Fin de semaine nuit",null,{"$f":"TEXT(IF(AND(H88<>\"\",K87=\"FDS\",M87<>\"F\"),H88+0,\"0\"),\"hh:mm\")","v":{"$error":"#VALUE!"}},{"$f":"$D$6","v":39.25},{"$f":"IF(C100<>\"\",ROUND(C100*24,2),\"0\")","v":{"$error":"#VALUE!"}},{"$f":"C100*'Calculs choix indemnité'!$F$17","v":{"$error":"#VALUE!"}},{"$error":"#VALUE!"},0]
["Férié nuit",null,{"$f":"TEXT(IF(AND(H88<>\"\",M87=\"F\"),H88+0,\"0\"),\"hh:mm\")","v":{"$error":"#VALUE!"}},{"$f":"$D$8","v":49},{"$f":"IF(C101<>\"\",ROUND(C101*24,2),\"0\")","v":{"$error":"#VALUE!"}},{"$f":"C101*'Calculs choix indemnité'!$F$17","v":{"$error":"#VALUE!"}},{"$error":"#VALUE!"},0]
[null,{"$f":"SUM(B93:B101)","v":{"$error":"#N/A"}},{"$f":"SUM(C93:C101)","v":{"$error":"#VALUE!"}},null,{"$f":"SUM(E93:E101)","v":{"$error":"#N/A"}},{"$f":"SUM(F93:F101)","v":{"$error":"#N/A"}},{"$f":"SUM(G93:G101)","v":{"$error":"#N/A"}},{"$f":"SUM($H93:$H101)","v":0}]
[]
[]
[]
[null,"Début","Fin",null,null,null,"Assistance"]
["Date début /  fin",{"$f":"Assistance!D21","v":"00:00:00"},{"$f":"Assistance!F21","v":"00:00:00"},{"$f":"TEXT(B107,\"aaaa-mm-jj \")&TEXT(B108,\"hh:mm\")","v":"1900-01-00 00:00"}]
["Heure début / fin",{"$f":"Assistance!D23","v":"00:00:00"},{"$f":"Assistance!F23","v":"00:00:00"},{"$f":"TEXT(C107,\"aaaa-mm-jj \")&TEXT(C108,\"hh:mm\")","v":"1900-01-00 00:00"},null,{"$f":"IF(AND(B109>$A$8,B109<$A$7),B109,\"\")","v":""}]
["Heure modifiée",{"$f":"TEXT(B108,\"hh:mm\")","v":"00:00"},{"$f":"TEXT(IF(D109<K123,C108,B109+K123),\"hh:mm\")","v":{"$error":"#VALUE!"}},{"$f":"D108-D107","v":{"$error":"#VALUE!"}}]
[]
[]
[]
[null,null,null,null,{"$f":"IF(E115>=K123,\"Dépassement\",\"\")","v":"Dépassement"},null,{"$f":"IFERROR(IF(AND(B118=\"oui\",D109<K123),$A$10-C118,$A$10-C118),\"\")","v":""},{"$f":"TEXT(IFERROR(IF(AND(C109>$A$8,B118=\"oui\"),$A$8,E118-G118),\"\"),\"hh:mm\")","v":""},{"$f":"IFERROR(IF(AND(E118-G113-H113>0,B118=\"oui\"),IF(C109-$A$8>0,C109-$A$8,\"\")),)","v":"00:00:00"},"Semaine  ou FDS",null,"Férié ou ordinaire"]
[null,null,"Début","Fin","Durée totale",null,"Durée jour 1","Durée nuit","Durée jour 2","Jour 1","Jour 2","Jour 1","Jour 2"]
["Jour + Jour",{"$f":"IF(C107-B107=0,\n\"oui\",IF(AND(C107-B107=1,B109+K61<=A10),\n\"oui\",\n\"non\"))","v":"oui"},{"$f":"IF(AND(B109>=$A$8,B109<=$A$7,B115=\"oui\"),B109,\"\")","v":""},{"$f":"IF(C115<>\"\",C109,\"\")","v":""},{"$f":"IF(AND(D115=\"\",C115=\"\"),\"\",IF(D115=\"00:00\",A103-B109,D115-C115))","v":""},null,{"$f":"$E115","v":""},null,null,{"$f":"IFERROR(IF(VLOOKUP(B107,'Jours fériés'!$B$4:$E$5000,2,FALSE)=\"s\",\"S\",\"FDS\"),0)","v":0},null,{"$f":"IF(VLOOKUP(B107,'Jours fériés'!$B$4:$E$5000,3,FALSE)=\"Oui\",\"F\",\"\")","v":{"$error":"#N/A"}}]
["Nuit+ Nuit",{"$f":"IF(C107-B107=0,\"oui\",\"non\")","v":"oui"},{"$f":"IF(AND(B109>=$A$5,\nC109<=$A$8,\nB116=\"oui\"),\nB109,\"\")","v":{"$error":"#VALUE!"}},{"$f":"IF(C116<>\"\",C109,\"\")","v":{"$error":"#VALUE!"}},{"$f":"TEXT(IF(D116<>\"\",D116-C116,\"\"),\"hh:mm\")","v":{"$error":"#VALUE!"}},null,null,{"$f":"TEXT($E116,\"hh:mm\")","v":{"$error":"#VALUE!"}},null,{"$f":"IF(VLOOKUP(B107,'Jours fériés'!B94:$E$5000,2,FALSE)=\"s\",\"S\",\"FDS\")","v":{"$error":"#N/A"}},null,{"$f":"IF(VLOOKUP(B107,'Jours fériés'!$B$4:$E$5000,3,FALSE)=\"Oui\",\"F\",\"\")","v":{"$error":"#N/A"}}]
["Nuit + Jour",{"$f":"IF(C107-B107=0,\"oui\",\"non\")","v":"oui"},{"$f":"IF(AND(B109>=$A$5,\nB109<$A$8,\nC109>$A$8,\nB117=\"oui\"),\nB109,\"\")","v":{"$error":"#VALUE!"}},{"$f":"IF(C117<>\"\",C109,\"\")","v":{"$error":"#VALUE!"}},{"$f":"TEXT(IF(D117<>\"\",D117-C117,\"\"),\"hh:mm\")","v":{"$error":"#VALUE!"}},null,null,{"$f":"TEXT(IF(D117<>\"\",$A$8-C117,\"\"),\"hh:mm\")","v":{"$error":"#VALUE!"}},{"$f":"IF(E117<>\"\",D117-$A$8,\"\")","v":{"$error":"#VALUE!"}},{"$f":"IF(VLOOKUP(B107,'Jours fériés'!$B$4:$E$5000,2,FALSE)=\"s\",\"S\",\"FDS\")","v":{"$error":"#N/A"}},{"$f":"IF(VLOOKUP(C107,'Jours fériés'!$B$4:$E$5000,2,FALSE)=\"s\",\"S\",\"FDS\")","v":{"$error":"#N/A"}},{"$f":"IF(VLOOKUP(B107,'Jours fériés'!$B$4:$E$5000,3,FALSE)=\"Oui\",\"F\",\"\")","v":{"$error":"#N/A"}},{"$f":"IF(VLOOKUP(C107,'Jours fériés'!$B$4:$E$5000,3,FALSE)=\"Oui\",\"F\",\"\")","v":{"$error":"#N/A"}}]
["Jour + Nuit",{"$f":"IF(AND(C107-B107=1,B109+K61<=A41),\n\"non\",IF(C107-B107=1,\"oui\",\"non\"))","v":"non"},{"$f":"IF(B118=\"oui\",B108,\"\")","v":""},{"$f":"IF(C118<>\"\",C109,\"\")","v":""},{"$f":"IF(D118<>\"\",($A$10-C118)+D118,\"\")","v":""},null,{"$f":"IF(G113=\"\",\"\",G113)","v":""},{"$f":"TEXT(IFERROR(IF(H113=\"\",\"\",H113),\"\"),\"hh:mm\")","v":""},{"$f":"IFERROR(IF(I113=\"\",\"\",I113),\"\")","v":"00:00:00"},{"$f":"IF(VLOOKUP(B107,'Jours fériés'!$B$4:$E$5000,2,FALSE)=\"s\",\"S\",\"FDS\")","v":{"$error":"#N/A"}},{"$f":"IF(VLOOKUP(C107,'Jours fériés'!$B$4:$E$5000,2,FALSE)=\"s\",\"S\",\"FDS\")","v":{"$error":"#N/A"}},{"$f":"IF(VLOOKUP(B107,'Jours fériés'!$B$4:$E$5000,3,FALSE)=\"Oui\",\"F\",\"\")","v":{"$error":"#N/A"}},{"$f":"IF(VLOOKUP(C107,'Jours fériés'!$B$4:$E$5000,3,FALSE)=\"Oui\",\"F\",\"\")","v":{"$error":"#N/A"}}]
[null,null,{"$f":"C118","v":""},{"$f":"D118","v":""},{"$f":"SUM(E115:E118)","v":{"$error":"#VALUE!"}},null,{"$f":"TEXT(IF(L126=TRUE,SUM(G115:G118),\"\"),\"hh:mm\")","v":""},{"$f":"IF(H116<>\"\",H116,IF(H117<>\"\",H117,IF(H118<>\"\",H118,\"\")))","v":{"$error":"#VALUE!"}},{"$f":"TEXT(IF(L128=TRUE,SUM(I115:I118),\"\"),\"hh:mm\")","v":{"$error":"#VALUE!"}}]
[]
[]
[]
[null,"JOUR","NUIT","Taux","en centièmes X 1",null,null,"TOTAL",null,null,"09:00:00",null,"09:00:00","18:00:00"]
["Semaine jour 1",{"$f":"TEXT(IF(AND(G119<>\"\",J118=\"S\",L118<>\"F\"),G119,\"0\"),\"hh:mm\")","v":{"$error":"#N/A"}},null,{"$f":"$D$3","v":29.25},{"$f":"IF(AND(B124<>$A$5,B124<>\"\"),ROUND(B124*24,2),)","v":{"$error":"#N/A"}},null,null,{"$f":"IF(AND(G124=0,$N126=1),E124*D124,IF($N126=2,G124*D124,))","v":{"$error":"#N/A"}},null,null,null,null,"09:00:00","18:00:00"]
["Semaine jour 2",{"$f":"TEXT(IF(AND(I119<>\"\",K118=\"S\",M118<>\"F\"),I119,\"0\"),\"hh:mm\")","v":{"$error":"#VALUE!"}},null,{"$f":"$D$3","v":29.25},{"$error":"#VALUE!"},null,null,{"$f":"IF(AND(G125=0,$N126=1),E125*D125,IF($N126=2,G125*D125,))","v":{"$error":"#VALUE!"}},null,null,"Tableau Total en orange:",{"$f":"OR($H124<>\"\",$H125<>\"\",$H126<>\"\",$H127<>\"\",$H128<>\"\",$H129<>\"\",$H130<>\"\",$H131<>\"\",$H132<>\"\")","v":{"$error":"#N/A"}}]
["Fin de semaine jour 1",{"$f":"TEXT(IF(AND(G119<>\"\",J118=\"fds\",L118<>\"F\"),G119,\"0\"),\"hh:mm\")","v":{"$error":"#N/A"}},null,{"$f":"$D$5","v":32.5},{"$error":"#N/A"},null,null,{"$f":"IF(AND(G126=0,$N126=1),E126*D126,IF($N126=2,G126*D126,))","v":{"$error":"#N/A"}},null,null,"Tableau durée jour:",{"$f":"OR($G115<>\"\",$G117<>\"\",$G118<>\"\")","v":false},"nbre préposés",1]
["Fin de semaine jour 2",{"$f":"TEXT(IF(AND(I119<>\"\",K118=\"fds\",M118<>\"F\"),I119,\"0\"),\"hh:mm\")","v":{"$error":"#VALUE!"}},null,{"$f":"$D$5","v":32.5},{"$error":"#VALUE!"},null,null,{"$f":"IF(AND(G127=0,$N126=1),E127*D127,IF($N126=2,G127*D127,))","v":{"$error":"#VALUE!"}},null,null,"Tableau durée nuit:",{"$f":"OR($H115<>\"\",$H116<>\"\",$H117<>\"\",$H118<>\"\")","v":{"$error":"#VALUE!"}}]
["Férié jour 1",{"$f":"TEXT(IF(AND(G119<>\"\",L118=\"F\"),G119,\"0\"),\"hh:mm\")","v":{"$error":"#N/A"}},null,{"$f":"$D$7","v":40.75},{"$error":"#N/A"},null,null,{"$f":"IF(AND(G128=0,$N126=1),E128*D128,IF($N126=2,G128*D128,))","v":{"$error":"#N/A"}},null,null,"Tableau durée jour 2:",{"$f":"OR(I116<>\"\",I117<>\"\",I118<>\"\")","v":{"$error":"#VALUE!"}}]
["Férie jour 2",{"$f":"TEXT(IF(AND(I119<>\"\",M118=\"F\"),I119,\"0\"),\"hh:mm\")","v":{"$error":"#VALUE!"}},null,{"$f":"$D$7","v":40.75},{"$error":"#VALUE!"},null,null,{"$f":"IF(AND(G129=0,$N126=1),E129*D129,IF($N126=2,G129*D129,))","v":{"$error":"#VALUE!"}}]
["Semaine nuit",null,{"$f":"TEXT(IF(AND(H119<>\"\",K118=\"S\",M118<>\"F\"),H119+0,\"0\"),\"hh:mm\")","v":{"$error":"#VALUE!"}},{"$f":"$D$4","v":36.25},{"$f":"IF(C130<>\"\",ROUND(C130*24,2),\"0\")","v":{"$error":"#VALUE!"}},null,null,{"$f":"IF(AND(G130=0,$N126=1),E130*D130,IF($N126=2,G130*D130,))","v":{"$error":"#VALUE!"}}]
["Fin de semaine nuit",null,{"$f":"TEXT(IF(AND(H119<>\"\",K118=\"FDS\",M118<>\"F\"),H119+0,\"0\"),\"hh:mm\")","v":{"$error":"#VALUE!"}},{"$f":"$D$6","v":39.25},{"$f":"IF(C131<>\"\",ROUND(C131*24,2),\"0\")","v":{"$error":"#VALUE!"}},null,null,{"$f":"IF(AND(G131=0,$N126=1),E131*D131,IF($N126=2,G131*D131,))","v":{"$error":"#VALUE!"}}]
["Férié nuit",null,{"$f":"TEXT(IF(AND(H119<>\"\",M118=\"F\"),H119+0,\"0\"),\"hh:mm\")","v":{"$error":"#VALUE!"}},{"$f":"$D$8","v":49},{"$f":"IF(C132<>\"\",ROUND(C132*24,2),\"0\")","v":{"$error":"#VALUE!"}},null,null,{"$f":"IF(AND(G132=0,$N126=1),E132*D132,IF($N126=2,G132*D132,))","v":{"$error":"#VALUE!"}}]
[null,{"$f":"SUM(B124:B132)","v":{"$error":"#N/A"}},{"$f":"SUM(C124:C132)","v":{"$error":"#VALUE!"}},null,{"$f":"SUM(E124:E132)","v":{"$error":"#N/A"}},{"$f":"SUM(F124:F132)","v":0},{"$f":"SUM(G124:G132)","v":0},{"$f":"SUM($H124:$H132)","v":{"$error":"#N/A"}}]

{"sheet":"Calculs choix indemnité","index":9,"n_rows":38,"n_cols":7,"rows_kept":38,"cut":false,"hidden":true,"merged":[[9,3,9,10],[10,3,10,10],[35,0,35,6],[32,0,32,5],[34,0,34,5],[33,0,33,5],[18,2,18,7]]}
[]
[]
["NE RIEN MODIFIER DANS CE TABLEAU SOUS PEINE D'ÉLECTROCUTION"]
[]
[null,null,"1er trsp"]
[]
[{"$f":"IF(Général!$G$14=\"\",\"\",(TEXT(Général!$G$14,\"aaaa-mm-jj\")))","v":""},{"$f":"IF(Général!$L$14=\"\",\"\",TEXT(Général!$L$14,\"aaaa-mm-jj\"))","v":""}]
[{"$f":"IF(Général!$G$16=\"\",\"\",TEXT(Général!$G$16,\"hh:mm\"))","v":""},{"$f":"IF(Général!$L$16=\"\",\"\",TEXT(Général!$L$16,\"hh:mm\"))","v":""},{"$f":"B9-A9","v":{"$error":"#VALUE!"}}]
[{"$f":"A7&\" \"&A8","v":" "},{"$f":"B7&\" \"&B8","v":" "}]
[{"$f":"B9-A9","v":{"$error":"#VALUE!"}},{"$f":"IF(A10<A12,A21,IF(AND(A10>=A12,Hébergement!D17=\"\"),A22,IF(A10<A13,A23,IF(A10<A14,A24,IF(A10>A14,A25)))))","v":{"$error":"#VALUE!"}},null,"Inscrivez d'abord les dépenses réelles dans Repas et Stationnement. Choisissez ensuite la ville de votre destination. Enfin, utilisez le bouton Choix pour effectuer un choix entre l'indemnité journalière ou les dépenses réelles."]
[{"$f":"TEXT(B9-A9,\"[hh]:mm\")","v":{"$error":"#VALUE!"}}," et comprend un coucher.",null,"Inscrivez d'abord les dépenses réelles dans Repas, Hébergement et Stationnement. Utilisez ensuite le bouton Choix pour effectuer un choix entre l'indemnité journalière ou les dépenses réelles."]
["12:00:00"," et ne comprend pas de coucher."]
[0.75]
[1]
["choisi dans Hébergement","choisi dans Hébergement","pour faciliter l'indexation","Indemnité de 50 %","Indemnité de 100 %","nombre de préposés"]
[{"$f":"Hébergement!D17","v":0},{"$f":"Hébergement!D19","v":0},{"$f":"IF($B16=\"entre le 1er juillet et le 31 octobre\",\"haute saison\",\"basse saison\")","v":"basse saison"},{"$f":"INDEX(TAUX!$G$50:$H$58,MATCH($A16,TAUX!$F$50:$F$58,0),MATCH($C16,TAUX!$G$49:$H$49,0))","v":{"$error":"#N/A"}}]
[{"$f":"Hébergement!D17","v":0},{"$f":"Hébergement!D19","v":0},{"$f":"IF($B17=\"entre le 1er juillet et le 31 octobre\",\"haute saison\",\"basse saison\")","v":"basse saison"},null,{"$f":"INDEX(TAUX!$C$50:$D$58,MATCH($A17,TAUX!$B$50:$B$58,0),MATCH($C17,TAUX!$C$49:$D$49,0))","v":{"$error":"#N/A"}},{"$f":"Divers!$H$21","v":0}]
[{"$f":"B10","v":{"$error":"#VALUE!"}}]
[null,null,"Vous pouvez choisir de demander le remboursement des dépenses réelles ou une indemnité journalière. Inscrivez d'abord le coût des repas via le bouton Repas et le coût de l'hébergement via le bouton Hébergement. Effectuez ensuite votre choix via le bouton Choix."]
[]
["est inférieure à 12 heures",null,"La durée du transport est inférieure à 12 heures.",null,null,null,"La durée du transport est inférieure à 12 heures."]
["est supérieure à 12 heures",null,"La durée du transport est supérieure à 12 heures et ne comprend pas de coucher.",null,null,null,"La durée du transport est supérieure à 12 heures "]
["se situe entre 12 et 18 heures",null,"La durée du transport se situe entre 12 et 18 heures et comprend un coucher.",null,null,null,"La durée du transport se situe entre 12 et 18 heures"]
["se situe entre 18 et 24 heures",null,"La durée du transport se situe entre 18 et 24 heures et comprend un coucher.",null,null,null,"La durée du transport se situe entre 18 et 24 heures "]
["est supérieure à 24 heures",null,"La durée du transport est supérieure à 24 heures et comprend un coucher.",null,null,null,"La durée du transport est supérieure à 24 heures "]
[]
["Vous ne pouvez pas demander le remboursement des frais d'hébergement, par contre, vous avez droit au remboursement repas, s'il y a lieu."]
["Vous avez droit de demander le remboursement des frais d'hébergement et des repas, s'il y a lieu."]
[]
["Vous ne pouvez pas demander le remboursement des frais d'hébergement. Veuillez choisir NON s.v.p.!"]
[]
[]
["Vous n'avez pas droit à une indemnité journalière et devez demander le remboursement de vos dépenses relles pour les repas, s'il y a lieu, sur présentation de factures originales."]
["Vous pouvez choisir de demander 50 % de l'indemnité journalière prévue sans présentation de factures ou le remboursement des dépenses réelles sur présentation des factures originales."]
["Vous pouvez choisir de demander 100 % de l'indemnité journalière prévue sans présentation de factures ou le remboursement des dépenses réelles sur présentation des factures originales."]
["Vous pouvez choisir de demander 100 % de l'indemnité journalière prévue + les repas supplémentaires pris au-delà des 24 heures sans présentation de factures ou le remboursement des dépenses réelles sur présentation des factures originales."]
["50 % de l'indemnité prévue"]
["100 % de l'indemnité prévue + les repas pris au-delà de la période de 24 heures."]

{"sheet":"Divers","index":10,"n_rows":1168,"n_cols":8,"rows_kept":1168,"cut":false,"hidden":true,"merged":[]}
[]
[null,null,null,null,null,null,null,"Non"]
[null,null,"Pour calculer les frais de garde",null,null,"Période de coucher",null,"Oui"]
[]
[null,null,null,null,null,"Entre le 1er juillet et le 31 octobre"]
[null,null,"Cumulatif période de garde de 24 heures",null,null,"Entre le 1er novembre et le 30 juin"]
[null,"1 jour",1,null,null,null,"Entre le 1er novembre et le 30 juin","entre le 1er juillet et le 31 octobre"]
[null,"2 jours",2,null,null,"Montréal",{"$f":"TAUX!C50","v":219},{"$f":"TAUX!D50","v":235}]
[null,"3 jours",3,null,null,"Québec",{"$f":"TAUX!C51","v":193},{"$f":"TAUX!D51","v":193}]
[null,"4 jours",4,null,null,"Laval",{"$f":"TAUX!C52","v":188},{"$f":"TAUX!D52","v":198}]
[null,"5 jours",5,null,null,"Gatineau",{"$f":"TAUX!C53","v":188},{"$f":"TAUX!D53","v":198}]
[null,"6 jours",6,null,null,"Longueuil",{"$f":"TAUX!C54","v":188},{"$f":"TAUX!D54","v":198}]
[null,"7 jours",7,null,null,"Lac-Beauport",{"$f":"TAUX!C55","v":188},{"$f":"TAUX!D55","v":198}]
[null,"8 jours",8,null,null,"Lac-Delage",{"$f":"TAUX!C56","v":188},{"$f":"TAUX!D56","v":198}]
[null,"9 jours",9,null,null,"Rimouski",{"$f":"TAUX!C57","v":164},{"$f":"TAUX!D57","v":169}]
[null,"10 jours",10,null,null,"Ailleurs",{"$f":"TAUX!C58","v":164},{"$f":"TAUX!D58","v":169}]
[null,"11 jours",11]
[null,null,null,null,null,null,"1er préposé",{"$f":"IFERROR(IF(Général!$G9<>\"\",1),\"\")","v":false}]
[null,"ATTENTION:",null,null,null,null,"2e préposé",{"$f":"IFERROR(IF(Général!$G10<>\"\",1),\"\")","v":false}]
[null,null,null,null,null,null,"3e préposé",{"$f":"IFERROR(IF(Général!$G11<>\"\",1),\"\")","v":false}]
[null,"NE RIEN MODIFIER DANS CE TABLEAU.",null,null,null,null,"Total nombre de préposés",{"$f":"H18+H19+H20","v":0}]
[null,"TOUTES LES DES DONNÉES PROVIENNENT DE L'ONGLET TAUX."]
[null,"SI CHANGEMENT DES TARIFS MAXIMUMS, FAIRE LES MODIFICATIONS DANS ONGLET TAUX",null,null,null,null,null,{"$f":"IFERROR(IF(Général!G9:J9<>\"\",1),\"\")","v":false}]
[]
[]
[]
[]
[null,"1 préposé en minutes","1 préposé en centièmes","2 préposés en centièmes","3 préposés en centièmes"]
[null,"00:00:00",0,0,0]
[null,"00:01:00",0.02,3.3333333333333333E-2,0.05]
[null,"00:02:00",0.03,6.6666666666666666E-2,0.1]
[null,"00:03:00",0.05,9.9999999999999839E-2,0.14999999999999974]
[null,"00:04:00",7.0000000000000007E-2,0.13333333333333297,0.19999999999999946]
[null,"00:05:00",0.08,0.16666666666666655,0.24999999999999983]
[null,"00:06:00",0.1,0.19999999999999968,0.29999999999999949]
[null,"00:07:00",0.12,0.23333333333333328,0.34999999999999992]
[null,"00:08:00",0.13,0.26666666666666639,0.39999999999999958]
[null,"00:09:00",0.15,0.30000000000000004,0.45000000000000007]
[null,"00:10:00",0.17,0.33333333333333309,0.49999999999999967]
[null,"00:11:00",0.18,0.36666666666666625,0.54999999999999938]
[null,"00:12:00",0.2,0.3999999999999998,0.59999999999999964]
[null,"00:13:00",0.22,0.43333333333333296,0.64999999999999947]
[null,"00:14:00",0.23,0.46666666666666656,0.69999999999999984]
[null,"00:15:00",0.25,0.50000000000000167,0.75000000000000244]
[null,"00:16:00",0.27,0.53333333333333277,0.79999999999999916]
[null,"00:17:00",0.28000000000000003,0.56666666666666399,0.84999999999999598]
[null,"00:18:00",0.3,0.60000000000000009,0.90000000000000013]
[null,"00:19:00",0.32,0.63333333333333119,0.94999999999999685]
[null,"00:20:00",0.33,0.66666666666666241,0.99999999999999356]
[null,"00:21:00",0.35,0.6999999999999984,1.0499999999999976]
[null,"00:22:00",0.37,0.73333333333332962,1.0999999999999943]
[null,"00:23:00",0.38,0.76666666666666561,1.1499999999999984]
[null,"00:24:00",0.4,0.79999999999999682,1.1999999999999953]
[null,"00:25:00",0.42,0.83333333333333282,1.2499999999999991]
[null,"00:26:00",0.43,0.86666666666666392,1.2999999999999958]
[null,"00:27:00",0.45,0.89999999999999991,1.3499999999999999]
[null,"00:28:00",0.47,0.93333333333333113,1.3999999999999968]
[null,"00:29:00",0.48,0.96666666666666234,1.4499999999999935]
[null,"00:30:00",0.5,0.99999999999999845,1.4999999999999978]
[null,"00:31:00",0.52,1.0333333333333297,1.5499999999999945]
[null,"00:32:00",0.53,1.0666666666666655,1.5999999999999983]
[null,"00:33:00",0.55000000000000004,1.0999999999999968,1.649999999999995]
[null,"00:34:00",0.56999999999999995,1.1333333333333329,1.6999999999999993]
[null,"00:35:00",0.57999999999999996,1.1666666666666641,1.749999999999996]
[null,"00:36:00",0.6,1.2000000000000002,1.8000000000000003]
[null,"00:37:00",0.62,1.2333333333333312,1.8499999999999968]
[null,"00:38:00",0.63,1.2666666666666624,1.8999999999999937]
[null,"00:39:00",0.65,1.2999999999999985,1.9499999999999977]
[null,"00:40:00",0.67,1.3333333333333295,1.9999999999999942]
[null,"00:41:00",0.68,1.3666666666666656,2.0499999999999985]
[null,"00:42:00",0.7,1.3999999999999968,2.0999999999999952]
[null,"00:43:00",0.72,1.4333333333333327,2.149999999999999]
[null,"00:44:00",0.73,1.4666666666666639,2.1999999999999957]
[null,"00:45:00",0.75,1.5,2.25]
[null,"00:46:00",0.77,1.5333333333333312,2.2999999999999967]
[null,"00:47:00",0.78,1.5666666666666624,2.3499999999999934]
[null,"00:48:00",0.8,1.5999999999999983,2.3999999999999977]
[null,"00:49:00",0.82,1.6333333333333295,2.4499999999999944]
[{"$f":"TEXT(B79,\"hh:mm\")","v":"00:50"},"00:50:00",0.83,1.6666666666666667,2.5]
[null,"00:51:00",0.85,1.699999999999992,2.5499999999999878]
[null,"00:52:00",0.87,1.7333333333333232,2.5999999999999845]
[null,"00:53:00",0.88,1.7666666666666544,2.6499999999999817]
[null,"00:54:00",0.9,1.7999999999999856,2.6999999999999784]
[null,"00:55:00",0.92,1.8333333333333168,2.7499999999999751]
[null,"00:56:00",0.93,1.866666666666648,2.7999999999999723]
[null,"00:57:00",0.95,1.8999999999999793,2.849999999999969]
[null,"00:58:00",0.97,1.9333333333333105,2.8999999999999657]
[null,"00:59:00",0.98,1.9666666666666417,2.9499999999999624]
[null,"01:00:00",1,1.9999999999999729,2.9999999999999591]
[null,"01:01:00",1.02,2.0333333333333039,3.0499999999999559]
[null,"01:02:00",1.03,2.0666666666666353,3.099999999999953]
[null,"01:03:00",1.05,2.0999999999999668,3.1499999999999502]
[null,"01:04:00",1.07,2.1333333333332973,3.199999999999946]
[null,"01:05:00",1.08,2.1666666666666288,3.2499999999999432]
[null,"01:06:00",1.1000000000000001,2.1999999999999598,3.2999999999999394]
[null,"01:07:00",1.1200000000000001,2.2333333333332912,3.3499999999999366]
[null,"01:08:00",1.1299999999999999,2.2666666666666222,3.3999999999999333]
[null,"01:09:00",1.1499999999999999,2.2999999999999536,3.4499999999999305]
[null,"01:10:00",1.17,2.3333333333332846,3.4999999999999272]
[null,"01:11:00",1.18,2.3666666666666161,3.5499999999999243]
[null,"01:12:00",1.2,2.3999999999999471,3.5999999999999206]
[null,"01:13:00",1.22,2.4333333333332785,3.6499999999999178]
[null,"01:14:00",1.23,2.4666666666666095,3.699999999999914]
[null,"01:15:00",1.25,2.4999999999999409,3.7499999999999112]
[null,"01:16:00",1.27,2.5333333333332719,3.7999999999999079]
[null,"01:17:00",1.28,2.5666666666666034,3.8499999999999051]
[null,"01:18:00",1.3,2.5999999999999344,3.8999999999999018]
[null,"01:19:00",1.32,2.6333333333332658,3.9499999999998989]
[null,"01:20:00",1.33,2.6666666666665968,3.9999999999998952]
[null,"01:21:00",1.35,2.6999999999999282,4.0499999999998924]
[null,"01:22:00",1.37,2.7333333333332592,4.0999999999998886]
[null,"01:23:00",1.38,2.7666666666665907,4.1499999999998858]
[null,"01:24:00",1.4,2.7999999999999217,4.199999999999882]
[null,"01:25:00",1.42,2.8333333333332527,4.2499999999998792]
[null,"01:26:00",1.43,2.8666666666665837,4.2999999999998755]
[null,"01:27:00",1.45,2.8999999999999151,4.3499999999998726]
[null,"01:28:00",1.47,2.9333333333332465,4.3999999999998698]
[null,"01:29:00",1.48,2.9666666666665775,4.4499999999998661]
[null,"01:30:00",1.5,2.9999999999999085,4.4999999999998632]
[null,"01:31:00",1.52,3.03333333333324,4.5499999999998604]
[null,"01:32:00",1.53,3.0666666666665714,4.5999999999998575]
[null,"01:33:00",1.55,3.0999999999999024,4.6499999999998538]
[null,"01:34:00",1.5699999999999998,3.1333333333332334,4.6999999999998501]
[null,"01:35:00",1.58,3.1666666666665648,4.7499999999998472]
[null,"01:36:00",1.6,3.1999999999998963,4.7999999999998444]
[null,"01:37:00",1.62,3.2333333333332273,4.8499999999998407]
[null,"01:38:00",1.63,3.2666666666665582,4.8999999999998369]
[null,"01:39:00",1.65,3.2999999999998897,4.9499999999998341]
[null,"01:40:00",1.67,3.3333333333332211,4.9999999999998312]
[null,"01:41:00",1.6800000000000002,3.3666666666665521,5.0499999999998284]
[null,"01:42:00",1.7,3.3999999999998831,5.0999999999998247]
[null,"01:43:00",1.72,3.4333333333332146,5.1499999999998218]
[null,"01:44:00",1.73,3.466666666666546,5.199999999999819]
[null,"01:45:00",1.75,3.499999999999877,5.2499999999998153]
[null,"01:46:00",1.77,3.533333333333208,5.2999999999998124]
[null,"01:47:00",1.78,3.5666666666665394,5.3499999999998096]
[null,"01:48:00",1.8,3.5999999999998709,5.3999999999998067]
[null,"01:49:00",1.8199999999999998,3.6333333333332019,5.449999999999803]
[null,"01:50:00",1.83,3.6666666666665328,5.4999999999997993]
[null,"01:51:00",1.85,3.6999999999998643,5.5499999999997964]
[null,"01:52:00",1.87,3.7333333333331957,5.5999999999997936]
[null,"01:53:00",1.88,3.7666666666665267,5.6499999999997899]
[null,"01:54:00",1.9,3.7999999999998573,5.6999999999997861]
[null,"01:55:00",1.92,3.8333333333331883,5.7499999999997824]
[null,"01:56:00",1.9300000000000002,3.8666666666665197,5.7999999999997796]
[null,"01:57:00",1.95,3.8999999999998511,5.8499999999997767]
[null,"01:58:00",1.97,3.9333333333331821,5.899999999999773]
[null,"01:59:00",1.98,3.9666666666665131,5.9499999999997701]
[null,"02:00:00",2,3.9999999999998446,5.9999999999997673]
[null,"02:01:00",2.02,4.033333333333176,6.0499999999997645]
[null,"02:02:00",2.0299999999999998,4.0666666666665066,6.0999999999997598]
[null,"02:03:00",2.0499999999999998,4.099999999999838,6.149999999999757]
[null,"02:04:00",2.0699999999999998,4.1333333333331694,6.1999999999997542]
[null,"02:05:00",2.08,4.1666666666665009,6.2499999999997513]
[null,"02:06:00",2.1,4.1999999999998323,6.2999999999997485]
[null,"02:07:00",2.12,4.2333333333331629,6.3499999999997438]
[null,"02:08:00",2.13,4.2666666666664943,6.399999999999741]
[null,"02:09:00",2.15,4.2999999999998257,6.4499999999997382]
[null,"02:10:00",2.17,4.3333333333331563,6.4999999999997344]
[null,"02:11:00",2.1800000000000002,4.3666666666664877,6.5499999999997316]
[null,"02:12:00",2.2000000000000002,4.3999999999998192,6.5999999999997288]
[null,"02:13:00",2.2200000000000002,4.4333333333331506,6.6499999999997259]
[null,"02:14:00",2.23,4.466666666666482,6.6999999999997231]
[null,"02:15:00",2.25,4.4999999999998126,6.7499999999997193]
[null,"02:16:00",2.27,4.533333333333144,6.7999999999997165]
[null,"02:17:00",2.2800000000000002,4.5666666666664755,6.8499999999997137]
[null,"02:18:00",2.2999999999999998,4.599999999999806,6.899999999999709]
[null,"02:19:00",2.3199999999999998,4.6333333333331375,6.9499999999997062]
[null,"02:20:00",2.33,4.6666666666664689,6.9999999999997033]
[null,"02:21:00",2.35,4.6999999999998003,7.0499999999997005]
[null,"02:22:00",2.37,4.7333333333331318,7.0999999999996977]
[null,"02:23:00",2.38,4.7666666666664623,7.149999999999693]
[null,"02:24:00",2.4,4.7999999999997938,7.1999999999996902]
[null,"02:25:00",2.42,4.8333333333331208,7.2499999999996811]
[null,"02:26:00",2.4300000000000002,4.8666666666664806,7.2999999999997209]
[null,"02:27:00",2.4500000000000002,4.8999999999997925,7.3499999999996888]
[null,"02:28:00",2.4699999999999998,4.9333333333331044,7.3999999999996566]
[null,"02:29:00",2.48,4.9666666666664643,7.4499999999996964]
[null,"02:30:00",2.5,4.9999999999997762,7.4999999999996643]
[null,"02:31:00",2.52,5.0333333333330881,7.5499999999996321]
[null,"02:32:00",2.5300000000000002,5.0666666666664479,7.5999999999996719]
[null,"02:33:00",2.5499999999999998,5.0999999999997598,7.6499999999996398]
[null,"02:34:00",2.57,5.1333333333331197,7.6999999999996795]
[null,"02:35:00",2.58,5.1666666666664316,7.7499999999996474]
[null,"02:36:00",2.6,5.1999999999997435,7.7999999999996152]
[null,"02:37:00",2.62,5.2333333333331042,7.8499999999996568]
[null,"02:38:00",2.63,5.2666666666664161,7.8999999999996238]
[null,"02:39:00",2.65,5.299999999999776,7.9499999999996636]
[null,"02:40:00",2.67,5.3333333333330879,7.9999999999996323]
[null,"02:41:00",2.68,5.3666666666663998,8.0499999999995993]
[null,"02:42:00",2.7,5.3999999999997605,8.0999999999996408]
[null,"02:43:00",2.7199999999999998,5.4333333333330724,8.1499999999996078]
[null,"02:44:00",2.73,5.4666666666664323,8.1999999999996476]
[null,"02:45:00",2.75,5.4999999999997442,8.2499999999996163]
[null,"02:46:00",2.77,5.5333333333330561,8.299999999999585]
[null,"02:47:00",2.7800000000000002,5.566666666666416,8.3499999999996248]
[null,"02:48:00",2.8,5.5999999999997279,8.3999999999995918]
[null,"02:49:00",2.82,5.6333333333330877,8.4499999999996316]
[null,"02:50:00",2.83,5.6666666666663996,8.4999999999995985]
[null,"02:51:00",2.85,5.6999999999997115,8.5499999999995673]
[null,"02:52:00",2.87,5.7333333333330714,8.5999999999996071]
[null,"02:53:00",2.88,5.7666666666663833,8.6499999999995758]
[null,"02:54:00",2.9,5.799999999999744,8.6999999999996156]
[null,"02:55:00",2.92,5.8333333333330559,8.7499999999995843]
[null,"02:56:00",2.93,5.8666666666664158,8.7999999999996241]
[null,"02:57:00",2.95,5.8999999999997277,8.8499999999995911]
[null,"02:58:00",2.9699999999999998,5.9333333333330396,8.8999999999995598]
[null,"02:59:00",2.98,5.9666666666664003,8.9499999999996014]
[null,"03:00:00",3,5.9999999999997122,8.9999999999995683]
[null,"03:01:00",3.02,6.0333333333330721,9.0499999999996081]
[null,"03:02:00",3.03,6.066666666666384,9.0999999999995751]
[null,"03:03:00",3.05,6.0999999999996959,9.1499999999995438]
[null,"03:04:00",3.07,6.1333333333330557,9.1999999999995836]
[null,"03:05:00",3.08,6.1666666666663676,9.2499999999995524]
[null,"03:06:00",3.1,6.1999999999996795,9.2999999999995193]
[null,"03:07:00",3.12,6.2333333333330394,9.3499999999995591]
[null,"03:08:00",3.13,6.2666666666663531,9.3999999999995296]
[null,"03:09:00",3.15,6.2999999999997129,9.4499999999995694]
[null,"03:10:00",3.17,6.3333333333330248,9.4999999999995381]
[null,"03:11:00",3.18,6.3666666666663367,9.5499999999995051]
[null,"03:12:00",3.2,6.3999999999996966,9.5999999999995449]
[null,"03:13:00",3.22,6.4333333333330085,9.6499999999995119]
[null,"03:14:00",3.23,6.4666666666663204,9.6999999999994806]
[null,"03:15:00",3.25,6.4999999999996803,9.7499999999995204]
[null,"03:16:00",3.27,6.5333333333329922,9.7999999999994891]
[null,"03:17:00",3.2800000000000002,6.566666666666352,9.8499999999995289]
[null,"03:18:00",3.3,6.5999999999996639,9.8999999999994959]
[null,"03:19:00",3.32,6.6333333333329758,9.9499999999994628]
[null,"03:20:00",3.33,6.6666666666663366,9.9999999999995044]
[null,"03:21:00",3.35,6.6999999999996485,10.049999999999473]
[null,"03:22:00",3.37,6.7333333333330083,10.099999999999513]
[null,"03:23:00",3.38,6.7666666666663202,10.14999999999948]
[null,"03:24:00",3.4,6.7999999999996321,10.199999999999449]
[null,"03:25:00",3.42,6.833333333332992,10.249999999999488]
[null,"03:26:00",3.43,6.8666666666663039,10.299999999999455]
[null,"03:27:00",3.45,6.8999999999996637,10.349999999999495]
[null,"03:28:00",3.4699999999999998,6.9333333333329756,10.399999999999464]
[null,"03:29:00",3.48,6.9666666666662875,10.449999999999431]
[null,"03:30:00",3.5,6.9999999999996474,10.499999999999471]
[null,"03:31:00",3.52,7.0333333333329602,10.549999999999439]
[null,"03:32:00",3.5300000000000002,7.06666666666632,10.599999999999479]
[null,"03:33:00",3.55,7.0999999999996319,10.649999999999448]
[null,"03:34:00",3.57,7.1333333333329438,10.699999999999417]
[null,"03:35:00",3.58,7.1666666666663037,10.749999999999456]
[null,"03:36:00",3.6,7.1999999999996156,10.799999999999423]
[null,"03:37:00",3.62,7.2333333333329755,10.849999999999463]
[null,"03:38:00",3.63,7.2666666666662874,10.89999999999943]
[null,"03:39:00",3.65,7.2999999999995993,10.949999999999399]
[null,"03:40:00",3.67,7.3333333333329591,10.999999999999439]
[null,"03:41:00",3.68,7.366666666666271,11.049999999999407]
[null,"03:42:00",3.7,7.3999999999996326,11.099999999999449]
[null,"03:43:00",3.7199999999999998,7.4333333333329445,11.149999999999416]
[null,"03:44:00",3.73,7.4666666666662564,11.199999999999385]
[null,"03:45:00",3.75,7.4999999999996163,11.249999999999424]
[null,"03:46:00",3.77,7.5333333333329282,11.299999999999393]
[null,"03:47:00",3.7800000000000002,7.5666666666662881,11.349999999999433]
[null,"03:48:00",3.8,7.5999999999996,11.3999999999994]
[null,"03:49:00",3.82,7.6333333333329119,11.449999999999367]
[null,"03:50:00",3.83,7.6666666666662717,11.499999999999407]
[null,"03:51:00",3.85,7.6999999999995836,11.549999999999375]
[null,"03:52:00",3.87,7.7333333333329435,11.599999999999415]
[null,"03:53:00",3.88,7.7666666666662554,11.649999999999384]
[null,"03:54:00",3.9,7.7999999999995691,11.699999999999353]
[null,"03:55:00",3.92,7.8333333333329289,11.749999999999392]
[null,"03:56:00",3.93,7.8666666666662408,11.799999999999361]
[null,"03:57:00",3.95,7.8999999999996007,11.849999999999401]
[null,"03:58:00",3.9699999999999998,7.9333333333329126,11.89999999999937]
[null,"03:59:00",3.98,7.9666666666662245,11.949999999999337]
[null,"04:00:00",4,7.9999999999995843,11.999999999999376]
[null,"04:01:00",4.0199999999999996,8.0333333333328962,12.049999999999343]
[null,"04:02:00",4.03,8.0666666666662561,12.099999999999383]
[null,"04:03:00",4.05,8.099999999999568,12.149999999999352]
[null,"04:04:00",4.07,8.1333333333328799,12.199999999999321]
[null,"04:05:00",4.08,8.1666666666662415,12.249999999999362]
[null,"04:06:00",4.0999999999999996,8.1999999999995516,12.299999999999327]
[null,"04:07:00",4.12,8.2333333333329115,12.349999999999367]
[null,"04:08:00",4.13,8.2666666666662252,12.399999999999338]
[null,"04:09:00",4.1500000000000004,8.2999999999995353,12.449999999999303]
[null,"04:10:00",4.17,8.3333333333328952,12.499999999999343]
[null,"04:11:00",4.18,8.3666666666662088,12.549999999999313]
[null,"04:12:00",4.2,8.3999999999995687,12.599999999999353]
[null,"04:13:00",4.22,8.4333333333328788,12.649999999999318]
[null,"04:14:00",4.2300000000000004,8.4666666666661925,12.699999999999289]
[null,"04:15:00",4.25,8.4999999999995524,12.749999999999329]
[null,"04:16:00",4.2699999999999996,8.5333333333328625,12.799999999999294]
[null,"04:17:00",4.28,8.5666666666662241,12.849999999999337]
[null,"04:18:00",4.3,8.599999999999536,12.899999999999304]
[null,"04:19:00",4.32,8.6333333333328479,12.949999999999271]
[null,"04:20:00",4.33,8.6666666666662078,12.999999999999311]
[null,"04:21:00",4.3499999999999996,8.6999999999995197,13.04999999999928]
[null,"04:22:00",4.37,8.7333333333328795,13.099999999999319]
[null,"04:23:00",4.38,8.7666666666661914,13.149999999999288]
[null,"04:24:00",4.4000000000000004,8.7999999999995033,13.199999999999255]
[null,"04:25:00",4.42,8.8333333333328632,13.249999999999295]
[null,"04:26:00",4.43,8.8666666666661751,13.299999999999262]
[null,"04:27:00",4.45,8.8999999999995349,13.349999999999302]
[null,"04:28:00",4.47,8.9333333333328486,13.399999999999274]
[null,"04:29:00",4.4800000000000004,8.9666666666661605,13.449999999999241]
[null,"04:30:00",4.5,8.9999999999995204,13.499999999999281]
[null,"04:31:00",4.5199999999999996,9.0333333333328323,13.549999999999248]
[null,"04:32:00",4.53,9.0666666666661921,13.599999999999287]
[null,"04:33:00",4.55,9.099999999999504,13.649999999999256]
[null,"04:34:00",4.57,9.1333333333328159,13.699999999999225]
[null,"04:35:00",4.58,9.1666666666661758,13.749999999999265]
[null,"04:36:00",4.5999999999999996,9.1999999999994877,13.799999999999232]
[null,"04:37:00",4.62,9.2333333333328476,13.849999999999271]
[null,"04:38:00",4.63,9.2666666666661595,13.899999999999238]
[null,"04:39:00",4.6500000000000004,9.2999999999994714,13.949999999999207]
[null,"04:40:00",4.67,9.333333333332833,13.99999999999925]
[null,"04:41:00",4.68,9.3666666666661449,14.049999999999217]
[null,"04:42:00",4.7,9.3999999999995048,14.099999999999257]
[null,"04:43:00",4.72,9.4333333333328167,14.149999999999224]
[null,"04:44:00",4.7300000000000004,9.4666666666661285,14.199999999999193]
[null,"04:45:00",4.75,9.4999999999994884,14.249999999999233]
[null,"04:46:00",4.7699999999999996,9.5333333333328003,14.299999999999201]
[null,"04:47:00",4.78,9.5666666666661602,14.349999999999241]
[null,"04:48:00",4.8,9.5999999999994721,14.399999999999208]
[null,"04:49:00",4.82,9.633333333332784,14.449999999999175]
[null,"04:50:00",4.83,9.6666666666661438,14.499999999999215]
[null,"04:51:00",4.8499999999999996,9.6999999999994557,14.549999999999184]
[null,"04:52:00",4.87,9.7333333333328156,14.599999999999223]
[null,"04:53:00",4.88,9.7666666666661293,14.649999999999194]
[null,"04:54:00",4.9000000000000004,9.7999999999994394,14.699999999999159]
[null,"04:55:00",4.92,9.8333333333327992,14.749999999999199]
[null,"04:56:00",4.93,9.8666666666661129,14.799999999999169]
[null,"04:57:00",4.95,9.8999999999994728,14.849999999999209]
[null,"04:58:00",4.97,9.9333333333327829,14.899999999999174]
[null,"04:59:00",4.9800000000000004,9.9666666666661428,14.949999999999214]
[null,"05:00:00",5,9.9999999999994564,14.999999999999185]
[null,"05:01:00",5.0199999999999996,10.033333333332767,15.04999999999915]
[null,"05:02:00",5.03,10.066666666666128,15.099999999999191]
[null,"05:03:00",5.05,10.09999999999944,15.14999999999916]
[null,"05:04:00",5.07,10.133333333332752,15.199999999999129]
[null,"05:05:00",5.08,10.166666666666112,15.249999999999169]
[null,"05:06:00",5.0999999999999996,10.199999999999424,15.299999999999136]
[null,"05:07:00",5.12,10.233333333332784,15.349999999999175]
[null,"05:08:00",5.13,10.266666666666096,15.399999999999142]
[null,"05:09:00",5.15,10.299999999999407,15.449999999999111]
[null,"05:10:00",5.17,10.333333333332767,15.499999999999151]
[null,"05:11:00",5.18,10.366666666666079,15.54999999999912]
[null,"05:12:00",5.2,10.399999999999439,15.599999999999159]
[null,"05:13:00",5.22,10.433333333332751,15.649999999999126]
[null,"05:14:00",5.23,10.466666666666065,15.699999999999097]
[null,"05:15:00",5.25,10.499999999999424,15.749999999999137]
[null,"05:16:00",5.27,10.533333333332736,15.799999999999105]
[null,"05:17:00",5.28,10.566666666666096,15.849999999999145]
[null,"05:18:00",5.3,10.599999999999408,15.899999999999112]
[null,"05:19:00",5.32,10.633333333332768,15.949999999999152]
[null,"05:20:00",5.33,10.66666666666608,15.999999999999119]
[null,"05:21:00",5.35,10.699999999999392,16.049999999999088]
[null,"05:22:00",5.37,10.733333333332752,16.099999999999127]
[null,"05:23:00",5.38,10.766666666666064,16.149999999999096]
[null,"05:24:00",5.4,10.799999999999375,16.199999999999065]
[null,"05:25:00",5.42,10.833333333332737,16.249999999999105]
[null,"05:26:00",5.43,10.866666666666049,16.299999999999073]
[null,"05:27:00",5.45,10.899999999999409,16.349999999999113]
[null,"05:28:00",5.47,10.933333333332721,16.399999999999082]
[null,"05:29:00",5.48,10.966666666666033,16.449999999999051]
[null,"05:30:00",5.5,10.999999999999392,16.499999999999091]
[null,"05:31:00",5.52,11.033333333332704,16.549999999999056]
[null,"05:32:00",5.53,11.066666666666064,16.599999999999095]
[null,"05:33:00",5.55,11.099999999999376,16.649999999999064]
[null,"05:34:00",5.57,11.133333333332688,16.699999999999033]
[null,"05:35:00",5.58,11.166666666666048,16.749999999999073]
[null,"05:36:00",5.6,11.19999999999936,16.799999999999038]
[null,"05:37:00",5.62,11.23333333333272,16.849999999999078]
[null,"05:38:00",5.63,11.266666666666033,16.89999999999905]
[null,"05:39:00",5.65,11.299999999999393,16.94999999999909]
[null,"05:40:00",5.67,11.333333333332703,16.999999999999055]
[null,"05:41:00",5.68,11.366666666666017,17.049999999999024]
[null,"05:42:00",5.7,11.399999999999377,17.099999999999064]
[null,"05:43:00",5.72,11.433333333332687,17.149999999999032]
[null,"05:44:00",5.73,11.466666666666047,17.199999999999072]
[null,"05:45:00",5.75,11.499999999999361,17.249999999999041]
[null,"05:46:00",5.77,11.533333333332671,17.299999999999006]
[null,"05:47:00",5.78,11.56666666666603,17.349999999999046]
[null,"05:48:00",5.8,11.599999999999344,17.399999999999018]
[null,"05:49:00",5.82,11.633333333332656,17.449999999998983]
[null,"05:50:00",5.83,11.666666666666016,17.499999999999023]
[null,"05:51:00",5.85,11.699999999999328,17.549999999998992]
[null,"05:52:00",5.87,11.733333333332688,17.599999999999032]
[null,"05:53:00",5.88,11.766666666666,17.649999999999]
[null,"05:54:00",5.9,11.799999999999359,17.69999999999904]
[null,"05:55:00",5.92,11.833333333332671,17.749999999999005]
[null,"05:56:00",5.93,11.866666666665983,17.799999999998974]
[null,"05:57:00",5.95,11.899999999999343,17.849999999999014]
[null,"05:58:00",5.97,11.933333333332655,17.899999999998983]
[null,"05:59:00",5.98,11.966666666666017,17.949999999999026]
[null,"06:00:00",6,11.999999999999329,17.999999999998991]
[null,"06:01:00",6.02,12.03333333333264,18.04999999999896]
[null,"06:02:00",6.03,12.066666666666,18.099999999999]
[null,"06:03:00",6.05,12.099999999999312,18.149999999998968]
[null,"06:04:00",6.07,12.133333333332672,18.199999999999008]
[null,"06:05:00",6.08,12.166666666665984,18.249999999998977]
[null,"06:06:00",6.1,12.199999999999296,18.299999999998946]
[null,"06:07:00",6.12,12.233333333332656,18.349999999998985]
[null,"06:08:00",6.13,12.266666666665968,18.399999999998951]
[null,"06:09:00",6.15,12.29999999999928,18.449999999998919]
[null,"06:10:00",6.17,12.333333333332639,18.499999999998959]
[null,"06:11:00",6.18,12.366666666665951,18.549999999998928]
[null,"06:12:00",6.2,12.399999999999311,18.599999999998968]
[null,"06:13:00",6.22,12.433333333332623,18.649999999998933]
[null,"06:14:00",6.23,12.466666666665983,18.699999999998973]
[null,"06:15:00",6.25,12.499999999999295,18.749999999998941]
[null,"06:16:00",6.27,12.533333333332607,18.79999999999891]
[null,"06:17:00",6.28,12.56666666666597,18.849999999998957]
[null,"06:18:00",6.3,12.59999999999928,18.899999999998919]
[null,"06:19:00",6.32,12.63333333333264,18.949999999998958]
[null,"06:20:00",6.33,12.666666666665954,18.999999999998931]
[null,"06:21:00",6.35,12.699999999999264,19.049999999998896]
[null,"06:22:00",6.37,12.733333333332624,19.099999999998936]
[null,"06:23:00",6.38,12.766666666665937,19.149999999998904]
[null,"06:24:00",6.4,12.799999999999297,19.199999999998944]
[null,"06:25:00",6.42,12.833333333332607,19.249999999998913]
[null,"06:26:00",6.43,12.866666666665921,19.299999999998882]
[null,"06:27:00",6.45,12.899999999999281,19.349999999998921]
[null,"06:28:00",6.47,12.933333333332591,19.399999999998887]
[null,"06:29:00",6.48,12.966666666665951,19.449999999998926]
[null,"06:30:00",6.5,12.999999999999265,19.499999999998899]
[null,"06:31:00",6.52,13.033333333332575,19.54999999999886]
[null,"06:32:00",6.53,13.066666666665935,19.5999999999989]
[null,"06:33:00",6.55,13.099999999999248,19.649999999998872]
[null,"06:34:00",6.57,13.133333333332608,19.699999999998912]
[null,"06:35:00",6.58,13.166666666665918,19.749999999998877]
[null,"06:36:00",6.6,13.199999999999232,19.799999999998846]
[null,"06:37:00",6.62,13.233333333332592,19.849999999998886]
[null,"06:38:00",6.63,13.266666666665902,19.899999999998855]
[null,"06:39:00",6.65,13.299999999999265,19.949999999998898]
[null,"06:40:00",6.67,13.333333333332577,19.999999999998867]
[null,"06:41:00",6.68,13.366666666665889,20.049999999998832]
[null,"06:42:00",6.7,13.399999999999249,20.099999999998872]
[null,"06:43:00",6.72,13.433333333332561,20.14999999999884]
[null,"06:44:00",6.73,13.466666666665921,20.19999999999888]
[null,"06:45:00",6.75,13.499999999999233,20.249999999998849]
[null,"06:46:00",6.77,13.533333333332545,20.299999999998818]
[null,"06:47:00",6.78,13.566666666665904,20.349999999998857]
[null,"06:48:00",6.8,13.599999999999216,20.399999999998826]
[null,"06:49:00",6.82,13.633333333332576,20.449999999998866]
[null,"06:50:00",6.83,13.666666666665888,20.499999999998831]
[null,"06:51:00",6.85,13.6999999999992,20.5499999999988]
[null,"06:52:00",6.87,13.73333333333256,20.59999999999884]
[null,"06:53:00",6.88,13.766666666665872,20.649999999998808]
[null,"06:54:00",6.9,13.799999999999232,20.699999999998848]
[null,"06:55:00",6.92,13.833333333332543,20.749999999998813]
[null,"06:56:00",6.93,13.866666666665855,20.799999999998782]
[null,"06:57:00",6.95,13.899999999999215,20.849999999998822]
[null,"06:58:00",6.97,13.933333333332527,20.899999999998791]
[null,"06:59:00",6.98,13.966666666665887,20.94999999999883]
[null,"07:00:00",7,13.999999999999199,20.999999999998799]
[null,"07:01:00",7.02,14.033333333332511,21.049999999998768]
[null,"07:02:00",7.03,14.066666666665874,21.099999999998811]
[null,"07:03:00",7.05,14.099999999999184,21.149999999998776]
[null,"07:04:00",7.07,14.133333333332544,21.199999999998816]
[null,"07:05:00",7.08,14.166666666665858,21.249999999998785]
[null,"07:06:00",7.1,14.199999999999168,21.299999999998754]
[null,"07:07:00",7.12,14.233333333332528,21.349999999998793]
[null,"07:08:00",7.13,14.266666666665841,21.399999999998762]
[null,"07:09:00",7.15,14.299999999999201,21.449999999998802]
[null,"07:10:00",7.17,14.333333333332511,21.499999999998767]
[null,"07:11:00",7.18,14.366666666665825,21.549999999998739]
[null,"07:12:00",7.2,14.399999999999185,21.599999999998779]
[null,"07:13:00",7.22,14.433333333332495,21.649999999998741]
[null,"07:14:00",7.23,14.466666666665855,21.699999999998781]
[null,"07:15:00",7.25,14.499999999999169,21.749999999998753]
[null,"07:16:00",7.27,14.533333333332479,21.799999999998718]
[null,"07:17:00",7.28,14.566666666665839,21.849999999998758]
[null,"07:18:00",7.3,14.599999999999152,21.899999999998727]
[null,"07:19:00",7.32,14.633333333332512,21.949999999998766]
[null,"07:20:00",7.33,14.666666666665822,21.999999999998735]
[null,"07:21:00",7.35,14.699999999999136,22.049999999998704]
[null,"07:22:00",7.37,14.733333333332496,22.099999999998744]
[null,"07:23:00",7.38,14.766666666665806,22.149999999998709]
[null,"07:24:00",7.4,14.799999999999166,22.199999999998749]
[null,"07:25:00",7.42,14.833333333332481,22.249999999998721]
[null,"07:26:00",7.43,14.866666666665793,22.29999999999869]
[null,"07:27:00",7.45,14.899999999999153,22.34999999999873]
[null,"07:28:00",7.47,14.933333333332465,22.399999999998698]
[null,"07:29:00",7.48,14.966666666665825,22.449999999998738]
[null,"07:30:00",7.5,14.999999999999137,22.499999999998707]
[null,"07:31:00",7.52,15.033333333332449,22.549999999998672]
[null,"07:32:00",7.53,15.066666666665808,22.599999999998712]
[null,"07:33:00",7.55,15.09999999999912,22.649999999998681]
[null,"07:34:00",7.57,15.13333333333248,22.69999999999872]
[null,"07:35:00",7.58,15.166666666665792,22.749999999998689]
[null,"07:36:00",7.6,15.199999999999104,22.799999999998654]
[null,"07:37:00",7.62,15.233333333332464,22.849999999998694]
[null,"07:38:00",7.63,15.266666666665776,22.899999999998663]
[null,"07:39:00",7.65,15.299999999999136,22.949999999998703]
[null,"07:40:00",7.67,15.333333333332448,22.999999999998671]
[null,"07:41:00",7.68,15.366666666665759,23.04999999999864]
[null,"07:42:00",7.7,15.399999999999119,23.09999999999868]
[null,"07:43:00",7.72,15.433333333332431,23.149999999998649]
[null,"07:44:00",7.73,15.466666666665791,23.199999999998688]
[null,"07:45:00",7.75,15.499999999999103,23.249999999998654]
[null,"07:46:00",7.77,15.533333333332415,23.299999999998622]
[null,"07:47:00",7.78,15.566666666665775,23.349999999998662]
[null,"07:48:00",7.8,15.599999999999088,23.399999999998634]
[null,"07:49:00",7.82,15.633333333332448,23.449999999998674]
[null,"07:50:00",7.83,15.666666666665762,23.499999999998643]
[null,"07:51:00",7.85,15.699999999999072,23.549999999998608]
[null,"07:52:00",7.87,15.733333333332432,23.599999999998648]
[null,"07:53:00",7.88,15.766666666665746,23.64999999999862]
[null,"07:54:00",7.9,15.799999999999105,23.69999999999866]
[null,"07:55:00",7.92,15.833333333332416,23.749999999998622]
[null,"07:56:00",7.93,15.866666666665729,23.799999999998594]
[null,"07:57:00",7.95,15.899999999999089,23.849999999998634]
[null,"07:58:00",7.97,15.933333333332399,23.899999999998599]
[null,"07:59:00",7.98,15.966666666665759,23.949999999998639]
[null,"08:00:00",8,15.999999999999073,23.999999999998607]
[null,"08:01:00",8.02,16.033333333332383,24.049999999998576]
[null,"08:02:00",8.0299999999999994,16.066666666665743,24.099999999998616]
[null,"08:03:00",8.0500000000000007,16.099999999999056,24.149999999998585]
[null,"08:04:00",8.07,16.133333333332416,24.199999999998624]
[null,"08:05:00",8.08,16.166666666665726,24.24999999999859]
[null,"08:06:00",8.1,16.19999999999904,24.299999999998562]
[null,"08:07:00",8.1199999999999992,16.2333333333324,24.349999999998602]
[null,"08:08:00",8.1300000000000008,16.26666666666571,24.399999999998563]
[null,"08:09:00",8.15,16.29999999999907,24.449999999998603]
[null,"08:10:00",8.17,16.333333333332384,24.499999999998575]
[null,"08:11:00",8.18,16.366666666665697,24.549999999998548]
[null,"08:12:00",8.1999999999999993,16.399999999999057,24.599999999998587]
[null,"08:13:00",8.2200000000000006,16.433333333332371,24.649999999998556]
[null,"08:14:00",8.23,16.466666666665731,24.699999999998596]
[null,"08:15:00",8.25,16.499999999999041,24.749999999998561]
[null,"08:16:00",8.27,16.533333333332351,24.799999999998526]
[null,"08:17:00",8.2799999999999994,16.566666666665711,24.849999999998566]
[null,"08:18:00",8.3000000000000007,16.599999999999024,24.899999999998535]
[null,"08:19:00",8.32,16.633333333332384,24.949999999998575]
[null,"08:20:00",8.33,16.666666666665698,24.999999999998547]
[null,"08:21:00",8.35,16.699999999999008,25.049999999998512]
[null,"08:22:00",8.3699999999999992,16.733333333332368,25.099999999998552]
[null,"08:23:00",8.3800000000000008,16.766666666665678,25.149999999998517]
[null,"08:24:00",8.4,16.799999999999038,25.199999999998557]
[null,"08:25:00",8.42,16.833333333332352,25.249999999998529]
[null,"08:26:00",8.43,16.866666666665665,25.299999999998498]
[null,"08:27:00",8.4499999999999993,16.899999999999025,25.349999999998538]
[null,"08:28:00",8.4700000000000006,16.933333333332335,25.399999999998503]
[null,"08:29:00",8.48,16.966666666665695,25.449999999998543]
[null,"08:30:00",8.5,16.999999999999005,25.499999999998508]
[null,"08:31:00",8.52,17.033333333332319,25.549999999998477]
[null,"08:32:00",8.5299999999999994,17.066666666665679,25.599999999998516]
[null,"08:33:00",8.5500000000000007,17.099999999998992,25.649999999998489]
[null,"08:34:00",8.57,17.133333333332352,25.699999999998528]
[null,"08:35:00",8.58,17.166666666665666,25.749999999998501]
[null,"08:36:00",8.6,17.199999999998976,25.799999999998462]
[null,"08:37:00",8.6199999999999992,17.233333333332336,25.849999999998502]
[null,"08:38:00",8.6300000000000008,17.26666666666565,25.899999999998474]
[null,"08:39:00",8.65,17.29999999999901,25.949999999998514]
[null,"08:40:00",8.67,17.33333333333232,25.999999999998479]
[null,"08:41:00",8.68,17.366666666665633,26.049999999998448]
[null,"08:42:00",8.6999999999999993,17.399999999998993,26.099999999998488]
[null,"08:43:00",8.7200000000000006,17.433333333332303,26.149999999998457]
[null,"08:44:00",8.73,17.466666666665663,26.199999999998496]
[null,"08:45:00",8.75,17.499999999998977,26.249999999998465]
[null,"08:46:00",8.77,17.533333333332287,26.29999999999843]
[null,"08:47:00",8.7799999999999994,17.566666666665647,26.34999999999847]
[null,"08:48:00",8.8000000000000007,17.59999999999896,26.399999999998442]
[null,"08:49:00",8.82,17.63333333333232,26.449999999998482]
[null,"08:50:00",8.83,17.66666666666563,26.499999999998444]
[null,"08:51:00",8.85,17.699999999998944,26.549999999998416]
[null,"08:52:00",8.8699999999999992,17.733333333332304,26.599999999998456]
[null,"08:53:00",8.8800000000000008,17.766666666665614,26.649999999998421]
[null,"08:54:00",8.9,17.799999999998974,26.699999999998461]
[null,"08:55:00",8.92,17.833333333332288,26.74999999999843]
[null,"08:56:00",8.93,17.866666666665601,26.799999999998402]
[null,"08:57:00",8.9499999999999993,17.899999999998961,26.849999999998442]
[null,"08:58:00",8.9700000000000006,17.933333333332271,26.899999999998407]
[null,"08:59:00",8.98,17.966666666665631,26.949999999998447]
[null,"09:00:00",9,17.999999999998945,26.999999999998415]
[null,"09:01:00",9.02,18.033333333332259,27.049999999998388]
[null,"09:02:00",9.0299999999999994,18.066666666665618,27.099999999998428]
[null,"09:03:00",9.0500000000000007,18.099999999998929,27.149999999998393]
[null,"09:04:00",9.07,18.133333333332288,27.199999999998433]
[null,"09:05:00",9.08,18.166666666665598,27.249999999998398]
[null,"09:06:00",9.1,18.199999999998912,27.29999999999837]
[null,"09:07:00",9.1199999999999992,18.233333333332272,27.34999999999841]
[null,"09:08:00",9.1300000000000008,18.266666666665586,27.399999999998379]
[null,"09:09:00",9.15,18.299999999998946,27.449999999998418]
[null,"09:10:00",9.17,18.333333333332256,27.499999999998384]
[null,"09:11:00",9.18,18.366666666665566,27.549999999998349]
[null,"09:12:00",9.1999999999999993,18.399999999998926,27.599999999998388]
[null,"09:13:00",9.2200000000000006,18.433333333332239,27.649999999998357]
[null,"09:14:00",9.23,18.466666666665599,27.699999999998397]
[null,"09:15:00",9.25,18.499999999998913,27.749999999998369]
[null,"09:16:00",9.27,18.533333333332223,27.799999999998334]
[null,"09:17:00",9.2799999999999994,18.566666666665583,27.849999999998374]
[null,"09:18:00",9.3000000000000007,18.599999999998893,27.899999999998339]
[null,"09:19:00",9.32,18.633333333332256,27.949999999998383]
[null,"09:20:00",9.33,18.66666666666557,27.999999999998355]
[null,"09:21:00",9.35,18.69999999999888,28.04999999999832]
[null,"09:22:00",9.3699999999999992,18.73333333333224,28.09999999999836]
[null,"09:23:00",9.3800000000000008,18.766666666665554,28.149999999998329]
[null,"09:24:00",9.4,18.799999999998914,28.199999999998369]
[null,"09:25:00",9.42,18.833333333332224,28.249999999998337]
[null,"09:26:00",9.43,18.866666666665537,28.299999999998306]
[null,"09:27:00",9.4499999999999993,18.899999999998897,28.349999999998346]
[null,"09:28:00",9.4700000000000006,18.933333333332207,28.399999999998311]
[null,"09:29:00",9.48,18.966666666665567,28.449999999998351]
[null,"09:30:00",9.5,18.999999999998881,28.499999999998323]
[null,"09:31:00",9.52,19.033333333332191,28.549999999998285]
[null,"09:32:00",9.5299999999999994,19.066666666665551,28.599999999998325]
[null,"09:33:00",9.5500000000000007,19.099999999998865,28.649999999998297]
[null,"09:34:00",9.57,19.133333333332224,28.699999999998337]
[null,"09:35:00",9.58,19.166666666665535,28.749999999998302]
[null,"09:36:00",9.6,19.199999999998848,28.799999999998271]
[null,"09:37:00",9.6199999999999992,19.233333333332208,28.84999999999831]
[null,"09:38:00",9.6300000000000008,19.266666666665518,28.899999999998279]
[null,"09:39:00",9.65,19.299999999998878,28.949999999998319]
[null,"09:40:00",9.67,19.333333333332192,28.999999999998288]
[null,"09:41:00",9.68,19.366666666665502,29.049999999998253]
[null,"09:42:00",9.6999999999999993,19.399999999998865,29.099999999998296]
[null,"09:43:00",9.7200000000000006,19.433333333332179,29.149999999998268]
[null,"09:44:00",9.73,19.466666666665539,29.199999999998308]
[null,"09:45:00",9.75,19.499999999998849,29.249999999998273]
[null,"09:46:00",9.77,19.533333333332159,29.299999999998239]
[null,"09:47:00",9.7799999999999994,19.566666666665519,29.349999999998278]
[null,"09:48:00",9.8000000000000007,19.599999999998833,29.399999999998251]
[null,"09:49:00",9.82,19.633333333332192,29.44999999999829]
[null,"09:50:00",9.83,19.666666666665506,29.499999999998259]
[null,"09:51:00",9.85,19.699999999998816,29.549999999998224]
[null,"09:52:00",9.8699999999999992,19.733333333332176,29.599999999998264]
[null,"09:53:00",9.8800000000000008,19.766666666665486,29.649999999998229]
[null,"09:54:00",9.9,19.799999999998846,29.699999999998269]
[null,"09:55:00",9.92,19.83333333333216,29.749999999998238]
[null,"09:56:00",9.93,19.866666666665473,29.79999999999821]
[null,"09:57:00",9.9499999999999993,19.899999999998833,29.84999999999825]
[null,"09:58:00",9.9700000000000006,19.933333333332143,29.899999999998215]
[null,"09:59:00",9.98,19.966666666665503,29.949999999998255]
[null,"10:00:00",10,19.999999999998813,29.99999999999822]
[null,"10:01:00",10.02,20.033333333332127,30.049999999998192]
[null,"10:02:00",10.029999999999999,20.066666666665487,30.099999999998232]
[null,"10:03:00",10.050000000000001,20.099999999998801,30.149999999998201]
[null,"10:04:00",10.07,20.13333333333216,30.199999999998241]
[null,"10:05:00",10.08,20.166666666665474,30.249999999998209]
[null,"10:06:00",10.1,20.199999999998784,30.299999999998178]
[null,"10:07:00",10.119999999999999,20.233333333332144,30.349999999998218]
[null,"10:08:00",10.130000000000001,20.266666666665458,30.399999999998187]
[null,"10:09:00",10.15,20.299999999998818,30.449999999998226]
[null,"10:10:00",10.17,20.333333333332128,30.499999999998192]
[null,"10:11:00",10.18,20.366666666665441,30.549999999998164]
[null,"10:12:00",10.199999999999999,20.399999999998801,30.599999999998204]
[null,"10:13:00",10.220000000000001,20.433333333332111,30.649999999998165]
[null,"10:14:00",10.23,20.466666666665471,30.699999999998205]
[null,"10:15:00",10.25,20.499999999998785,30.749999999998177]
[null,"10:16:00",10.27,20.533333333332095,30.799999999998143]
[null,"10:17:00",10.28,20.566666666665455,30.849999999998182]
[null,"10:18:00",10.3,20.599999999998769,30.899999999998151]
[null,"10:19:00",10.32,20.633333333332128,30.949999999998191]
[null,"10:20:00",10.33,20.666666666665439,30.99999999999816]
[null,"10:21:00",10.35,20.699999999998752,31.049999999998128]
[null,"10:22:00",10.37,20.733333333332112,31.099999999998168]
[null,"10:23:00",10.38,20.766666666665422,31.149999999998133]
[null,"10:24:00",10.4,20.799999999998782,31.199999999998173]
[null,"10:25:00",10.42,20.833333333332096,31.249999999998145]
[null,"10:26:00",10.43,20.866666666665406,31.299999999998107]
[null,"10:27:00",10.45,20.899999999998766,31.349999999998147]
[null,"10:28:00",10.47,20.933333333332079,31.399999999998119]
[null,"10:29:00",10.48,20.966666666665439,31.449999999998159]
[null,"10:30:00",10.5,20.999999999998753,31.499999999998131]
[null,"10:31:00",10.52,21.033333333332067,31.5499999999981]
[null,"10:32:00",10.53,21.066666666665427,31.59999999999814]
[null,"10:33:00",10.55,21.099999999998737,31.649999999998105]
[null,"10:34:00",10.57,21.133333333332097,31.699999999998145]
[null,"10:35:00",10.58,21.166666666665407,31.74999999999811]
[null,"10:36:00",10.6,21.19999999999872,31.799999999998079]
[null,"10:37:00",10.62,21.23333333333208,31.849999999998118]
[null,"10:38:00",10.63,21.266666666665394,31.899999999998091]
[null,"10:39:00",10.65,21.299999999998754,31.949999999998131]
[null,"10:40:00",10.67,21.333333333332064,31.999999999998096]
[null,"10:41:00",10.68,21.366666666665374,32.049999999998064]
[null,"10:42:00",10.7,21.399999999998734,32.099999999998104]
[null,"10:43:00",10.72,21.433333333332047,32.149999999998073]
[null,"10:44:00",10.73,21.466666666665407,32.199999999998113]
[null,"10:45:00",10.75,21.499999999998721,32.249999999998082]
[null,"10:46:00",10.77,21.533333333332031,32.29999999999805]
[null,"10:47:00",10.78,21.566666666665391,32.34999999999809]
[null,"10:48:00",10.8,21.599999999998701,32.399999999998052]
[null,"10:49:00",10.82,21.633333333332061,32.449999999998091]
[null,"10:50:00",10.83,21.666666666665378,32.499999999998067]
[null,"10:51:00",10.85,21.699999999998688,32.549999999998036]
[null,"10:52:00",10.87,21.733333333332048,32.599999999998076]
[null,"10:53:00",10.88,21.766666666665362,32.649999999998045]
[null,"10:54:00",10.9,21.799999999998722,32.699999999998084]
[null,"10:55:00",10.92,21.833333333332032,32.749999999998046]
[null,"10:56:00",10.93,21.866666666665346,32.799999999998022]
[null,"10:57:00",10.95,21.899999999998705,32.849999999998062]
[null,"10:58:00",10.97,21.933333333332016,32.899999999998023]
[null,"10:59:00",10.98,21.966666666665375,32.949999999998063]
[null,"11:00:00",11,21.999999999998689,32.999999999998032]
[null,"11:01:00",11.02,22.033333333331999,33.049999999998001]
[null,"11:02:00",11.03,22.066666666665359,33.09999999999804]
[null,"11:03:00",11.05,22.099999999998673,33.149999999998009]
[null,"11:04:00",11.07,22.133333333332033,33.199999999998049]
[null,"11:05:00",11.08,22.166666666665343,33.24999999999801]
[null,"11:06:00",11.1,22.199999999998656,33.299999999997986]
[null,"11:07:00",11.12,22.233333333332016,33.349999999998026]
[null,"11:08:00",11.13,22.266666666665326,33.399999999997988]
[null,"11:09:00",11.15,22.299999999998686,33.449999999998028]
[null,"11:10:00",11.17,22.333333333332,33.499999999997996]
[null,"11:11:00",11.18,22.36666666666531,33.549999999997965]
[null,"11:12:00",11.2,22.39999999999867,33.599999999998005]
[null,"11:13:00",11.22,22.433333333331987,33.649999999997981]
[null,"11:14:00",11.23,22.466666666665347,33.69999999999802]
[null,"11:15:00",11.25,22.499999999998657,33.749999999997982]
[null,"11:16:00",11.27,22.533333333331967,33.799999999997951]
[null,"11:17:00",11.28,22.566666666665327,33.849999999997991]
[null,"11:18:00",11.3,22.599999999998641,33.899999999997959]
[null,"11:19:00",11.32,22.633333333332001,33.949999999997999]
[null,"11:20:00",11.33,22.666666666665314,33.999999999997968]
[null,"11:21:00",11.35,22.699999999998624,34.049999999997937]
[null,"11:22:00",11.37,22.733333333331984,34.099999999997976]
[null,"11:23:00",11.38,22.766666666665294,34.149999999997945]
[null,"11:24:00",11.4,22.799999999998654,34.199999999997985]
[null,"11:25:00",11.42,22.833333333331968,34.249999999997954]
[null,"11:26:00",11.43,22.866666666665282,34.299999999997922]
[null,"11:27:00",11.45,22.899999999998641,34.349999999997962]
[null,"11:28:00",11.47,22.933333333331952,34.399999999997931]
[null,"11:29:00",11.48,22.966666666665311,34.449999999997971]
[null,"11:30:00",11.5,22.999999999998622,34.499999999997932]
[null,"11:31:00",11.52,23.033333333331935,34.549999999997901]
[null,"11:32:00",11.53,23.066666666665295,34.599999999997941]
[null,"11:33:00",11.55,23.099999999998609,34.649999999997917]
[null,"11:34:00",11.57,23.133333333331969,34.699999999997956]
[null,"11:35:00",11.58,23.166666666665279,34.749999999997918]
[null,"11:36:00",11.6,23.199999999998592,34.799999999997887]
[null,"11:37:00",11.62,23.233333333331952,34.849999999997927]
[null,"11:38:00",11.63,23.266666666665266,34.899999999997902]
[null,"11:39:00",11.65,23.299999999998626,34.949999999997942]
[null,"11:40:00",11.67,23.333333333331936,34.999999999997904]
[null,"11:41:00",11.68,23.36666666666525,35.049999999997873]
[null,"11:42:00",11.7,23.399999999998609,35.099999999997912]
[null,"11:43:00",11.72,23.43333333333192,35.149999999997881]
[null,"11:44:00",11.73,23.466666666665279,35.199999999997921]
[null,"11:45:00",11.75,23.499999999998593,35.24999999999789]
[null,"11:46:00",11.77,23.533333333331903,35.299999999997851]
[null,"11:47:00",11.78,23.566666666665263,35.349999999997891]
[null,"11:48:00",11.8,23.599999999998577,35.399999999997867]
[null,"11:49:00",11.82,23.633333333331937,35.449999999997907]
[null,"11:50:00",11.83,23.666666666665247,35.499999999997868]
[null,"11:51:00",11.85,23.69999999999856,35.549999999997837]
[null,"11:52:00",11.87,23.73333333333192,35.599999999997877]
[null,"11:53:00",11.88,23.76666666666523,35.649999999997846]
[null,"11:54:00",11.9,23.79999999999859,35.699999999997885]
[null,"11:55:00",11.92,23.833333333331904,35.749999999997854]
[null,"11:56:00",11.93,23.866666666665214,35.799999999997823]
[null,"11:57:00",11.95,23.899999999998574,35.849999999997863]
[null,"11:58:00",11.97,23.933333333331888,35.899999999997831]
[null,"11:59:00",11.98,23.966666666665247,35.949999999997871]
[null,"12:00:00",12,23.999999999998561,35.99999999999784]
[null,"12:01:00",12.02,24.033333333331875,36.049999999997809]
[null,"12:02:00",12.03,24.066666666665235,36.099999999997848]
[null,"12:03:00",12.05,24.099999999998545,36.149999999997817]
[null,"12:04:00",12.07,24.133333333331905,36.199999999997857]
[null,"12:05:00",12.08,24.166666666665215,36.249999999997826]
[null,"12:06:00",12.1,24.199999999998528,36.299999999997794]
[null,"12:07:00",12.12,24.233333333331888,36.349999999997834]
[null,"12:08:00",12.13,24.266666666665202,36.399999999997803]
[null,"12:09:00",12.15,24.299999999998562,36.449999999997843]
[null,"12:10:00",12.17,24.333333333331872,36.499999999997812]
[null,"12:11:00",12.18,24.366666666665182,36.549999999997773]
[null,"12:12:00",12.2,24.399999999998542,36.599999999997813]
[null,"12:13:00",12.22,24.433333333331856,36.649999999997782]
[null,"12:14:00",12.23,24.466666666665216,36.699999999997821]
[null,"12:15:00",12.25,24.499999999998529,36.749999999997797]
[null,"12:16:00",12.27,24.533333333331839,36.799999999997759]
[null,"12:17:00",12.28,24.566666666665199,36.849999999997799]
[null,"12:18:00",12.3,24.599999999998509,36.89999999999776]
[null,"12:19:00",12.32,24.633333333331869,36.9499999999978]
[null,"12:20:00",12.33,24.666666666665183,36.999999999997776]
[null,"12:21:00",12.35,24.699999999998496,37.049999999997745]
[null,"12:22:00",12.37,24.733333333331856,37.099999999997785]
[null,"12:23:00",12.38,24.766666666665166,37.149999999997746]
[null,"12:24:00",12.4,24.799999999998526,37.199999999997786]
[null,"12:25:00",12.42,24.833333333331836,37.249999999997755]
[null,"12:26:00",12.43,24.86666666666515,37.299999999997723]
[null,"12:27:00",12.45,24.89999999999851,37.349999999997763]
[null,"12:28:00",12.47,24.933333333331824,37.399999999997732]
[null,"12:29:00",12.48,24.966666666665184,37.449999999997772]
[null,"12:30:00",12.5,24.999999999998494,37.49999999999774]
[null,"12:31:00",12.52,25.033333333331804,37.549999999997709]
[null,"12:32:00",12.53,25.066666666665164,37.599999999997749]
[null,"12:33:00",12.55,25.099999999998481,37.649999999997718]
[null,"12:34:00",12.57,25.133333333331841,37.699999999997758]
[null,"12:35:00",12.58,25.166666666665154,37.749999999997733]
[null,"12:36:00",12.6,25.199999999998468,37.799999999997702]
[null,"12:37:00",12.62,25.233333333331828,37.849999999997742]
[null,"12:38:00",12.63,25.266666666665138,37.899999999997704]
[null,"12:39:00",12.65,25.299999999998498,37.949999999997743]
[null,"12:40:00",12.67,25.333333333331808,37.999999999997712]
[null,"12:41:00",12.68,25.366666666665122,38.049999999997681]
[null,"12:42:00",12.7,25.399999999998482,38.099999999997721]
[null,"12:43:00",12.72,25.433333333331795,38.149999999997689]
[null,"12:44:00",12.73,25.466666666665155,38.199999999997729]
[null,"12:45:00",12.75,25.499999999998465,38.249999999997698]
[null,"12:46:00",12.77,25.533333333331775,38.299999999997667]
[null,"12:47:00",12.78,25.566666666665135,38.349999999997706]
[null,"12:48:00",12.8,25.599999999998449,38.399999999997675]
[null,"12:49:00",12.82,25.633333333331809,38.449999999997715]
[null,"12:50:00",12.83,25.666666666665122,38.499999999997684]
[null,"12:51:00",12.85,25.699999999998433,38.549999999997652]
[null,"12:52:00",12.87,25.733333333331792,38.599999999997692]
[null,"12:53:00",12.88,25.766666666665103,38.649999999997654]
[null,"12:54:00",12.9,25.799999999998462,38.699999999997694]
[null,"12:55:00",12.92,25.833333333331776,38.749999999997662]
[null,"12:56:00",12.93,25.86666666666509,38.799999999997638]
[null,"12:57:00",12.95,25.89999999999845,38.849999999997678]
[null,"12:58:00",12.97,25.93333333333176,38.89999999999764]
[null,"12:59:00",12.98,25.96666666666512,38.949999999997679]
[null,"13:00:00",13,25.99999999999843,38.999999999997641]
[null,"13:01:00",13.02,26.033333333331743,39.049999999997617]
[null,"13:02:00",13.03,26.066666666665103,39.099999999997657]
[null,"13:03:00",13.05,26.099999999998417,39.149999999997625]
[null,"13:04:00",13.07,26.133333333331777,39.199999999997665]
[null,"13:05:00",13.08,26.166666666665087,39.249999999997627]
[null,"13:06:00",13.1,26.199999999998397,39.299999999997596]
[null,"13:07:00",13.12,26.233333333331757,39.349999999997635]
[null,"13:08:00",13.13,26.266666666665071,39.399999999997604]
[null,"13:09:00",13.15,26.29999999999843,39.449999999997644]
[null,"13:10:00",13.17,26.333333333331744,39.499999999997613]
[null,"13:11:00",13.18,26.366666666665054,39.549999999997581]
[null,"13:12:00",13.2,26.399999999998414,39.599999999997621]
[null,"13:13:00",13.22,26.433333333331724,39.64999999999759]
[null,"13:14:00",13.23,26.466666666665084,39.69999999999763]
[null,"13:15:00",13.25,26.499999999998398,39.749999999997598]
[null,"13:16:00",13.27,26.533333333331758,39.799999999997638]
[null,"13:17:00",13.28,26.566666666665071,39.849999999997607]
[null,"13:18:00",13.3,26.599999999998381,39.899999999997576]
[null,"13:19:00",13.32,26.633333333331748,39.949999999997623]
[null,"13:20:00",13.33,26.666666666665058,39.999999999997584]
[null,"13:21:00",13.35,26.699999999998418,40.049999999997624]
[null,"13:22:00",13.37,26.733333333331728,40.099999999997593]
[null,"13:23:00",13.38,26.766666666665042,40.149999999997561]
[null,"13:24:00",13.4,26.799999999998402,40.199999999997601]
[null,"13:25:00",13.42,26.833333333331716,40.24999999999757]
[null,"13:26:00",13.43,26.866666666665026,40.299999999997539]
[null,"13:27:00",13.45,26.899999999998386,40.349999999997578]
[null,"13:28:00",13.47,26.933333333331696,40.399999999997547]
[null,"13:29:00",13.48,26.966666666665056,40.449999999997587]
[null,"13:30:00",13.5,26.999999999998369,40.499999999997556]
[null,"13:31:00",13.52,27.033333333331683,40.549999999997524]
[null,"13:32:00",13.53,27.066666666665043,40.599999999997564]
[null,"13:33:00",13.55,27.099999999998353,40.649999999997533]
[null,"13:34:00",13.57,27.133333333331713,40.699999999997573]
[null,"13:35:00",13.58,27.166666666665023,40.749999999997534]
[null,"13:36:00",13.6,27.199999999998337,40.799999999997503]
[null,"13:37:00",13.62,27.233333333331696,40.849999999997543]
[null,"13:38:00",13.63,27.26666666666501,40.899999999997519]
[null,"13:39:00",13.65,27.29999999999837,40.949999999997559]
[null,"13:40:00",13.67,27.33333333333168,40.99999999999752]
[null,"13:41:00",13.68,27.36666666666499,41.049999999997482]
[null,"13:42:00",13.7,27.39999999999835,41.099999999997522]
[null,"13:43:00",13.72,27.433333333331664,41.149999999997497]
[null,"13:44:00",13.73,27.466666666665024,41.199999999997537]
[null,"13:45:00",13.75,27.499999999998337,41.249999999997506]
[null,"13:46:00",13.77,27.533333333331647,41.299999999997468]
[null,"13:47:00",13.78,27.566666666665007,41.349999999997507]
[null,"13:48:00",13.8,27.599999999998317,41.399999999997476]
[null,"13:49:00",13.82,27.633333333331677,41.449999999997516]
[null,"13:50:00",13.83,27.666666666664991,41.499999999997485]
[null,"13:51:00",13.85,27.699999999998305,41.549999999997453]
[null,"13:52:00",13.87,27.733333333331665,41.599999999997493]
[null,"13:53:00",13.88,27.766666666664975,41.649999999997462]
[null,"13:54:00",13.9,27.799999999998334,41.699999999997502]
[null,"13:55:00",13.92,27.833333333331645,41.74999999999747]
[null,"13:56:00",13.93,27.866666666664958,41.799999999997439]
[null,"13:57:00",13.95,27.899999999998318,41.849999999997479]
[null,"13:58:00",13.97,27.933333333331632,41.899999999997448]
[null,"13:59:00",13.98,27.966666666664992,41.949999999997488]
[null,"14:00:00",14,27.999999999998302,41.999999999997456]
[null,"14:01:00",14.02,28.033333333331662,42.049999999997496]
[null,"14:02:00",14.03,28.066666666664972,42.099999999997458]
[null,"14:03:00",14.05,28.099999999998285,42.149999999997426]
[null,"14:04:00",14.07,28.133333333331649,42.199999999997473]
[null,"14:05:00",14.08,28.166666666664963,42.249999999997442]
[null,"14:06:00",14.1,28.199999999998322,42.299999999997482]
[null,"14:07:00",14.12,28.233333333331636,42.349999999997451]
[null,"14:08:00",14.13,28.266666666664946,42.399999999997419]
[null,"14:09:00",14.15,28.299999999998306,42.449999999997459]
[null,"14:10:00",14.17,28.333333333331616,42.499999999997428]
[null,"14:11:00",14.18,28.36666666666493,42.549999999997397]
[null,"14:12:00",14.2,28.39999999999829,42.599999999997436]
[null,"14:13:00",14.22,28.433333333331603,42.649999999997405]
[null,"14:14:00",14.23,28.466666666664963,42.699999999997445]
[null,"14:15:00",14.25,28.499999999998273,42.749999999997414]
[null,"14:16:00",14.27,28.533333333331584,42.799999999997375]
[null,"14:17:00",14.28,28.566666666664943,42.849999999997415]
[null,"14:18:00",14.3,28.599999999998257,42.899999999997384]
[null,"14:19:00",14.32,28.633333333331617,42.949999999997424]
[null,"14:20:00",14.33,28.666666666664931,42.999999999997399]
[null,"14:21:00",14.35,28.699999999998241,43.049999999997361]
[null,"14:22:00",14.37,28.733333333331601,43.099999999997401]
[null,"14:23:00",14.38,28.766666666664911,43.149999999997362]
[null,"14:24:00",14.4,28.799999999998271,43.199999999997402]
[null,"14:25:00",14.42,28.833333333331584,43.249999999997378]
[null,"14:26:00",14.43,28.866666666664898,43.299999999997347]
[null,"14:27:00",14.45,28.899999999998258,43.349999999997387]
[null,"14:28:00",14.47,28.933333333331568,43.399999999997348]
[null,"14:29:00",14.48,28.966666666664928,43.449999999997388]
[null,"14:30:00",14.5,28.999999999998238,43.499999999997357]
[null,"14:31:00",14.52,29.033333333331552,43.549999999997326]
[null,"14:32:00",14.53,29.066666666664911,43.599999999997365]
[null,"14:33:00",14.55,29.099999999998225,43.649999999997334]
[null,"14:34:00",14.57,29.133333333331585,43.699999999997374]
[null,"14:35:00",14.58,29.166666666664895,43.749999999997343]
[null,"14:36:00",14.6,29.199999999998255,43.799999999997382]
[null,"14:37:00",14.62,29.233333333331565,43.849999999997351]
[null,"14:38:00",14.63,29.266666666664879,43.89999999999732]
[null,"14:39:00",14.65,29.299999999998239,43.94999999999736]
[null,"14:40:00",14.67,29.333333333331552,43.999999999997328]
[null,"14:41:00",14.68,29.366666666664912,44.049999999997368]
[null,"14:42:00",14.7,29.399999999998222,44.099999999997337]
[null,"14:43:00",14.72,29.433333333331532,44.149999999997299]
[null,"14:44:00",14.73,29.466666666664892,44.199999999997338]
[null,"14:45:00",14.75,29.499999999998206,44.249999999997307]
[null,"14:46:00",14.77,29.533333333331566,44.299999999997347]
[null,"14:47:00",14.78,29.566666666664879,44.349999999997323]
[null,"14:48:00",14.8,29.59999999999819,44.399999999997284]
[null,"14:49:00",14.82,29.633333333331549,44.449999999997324]
[null,"14:50:00",14.83,29.666666666664867,44.4999999999973]
[null,"14:51:00",14.85,29.699999999998226,44.54999999999734]
[null,"14:52:00",14.87,29.733333333331537,44.599999999997308]
[null,"14:53:00",14.88,29.76666666666485,44.649999999997277]
[null,"14:54:00",14.9,29.79999999999821,44.699999999997317]
[null,"14:55:00",14.92,29.833333333331524,44.749999999997286]
[null,"14:56:00",14.93,29.866666666664834,44.799999999997254]
[null,"14:57:00",14.95,29.899999999998194,44.849999999997294]
[null,"14:58:00",14.97,29.933333333331504,44.899999999997256]
[null,"14:59:00",14.98,29.966666666664864,44.949999999997296]
[null,"15:00:00",15,29.999999999998177,44.999999999997264]
[null,"15:01:00",15.02,30.033333333331491,45.04999999999724]
[null,"15:02:00",15.03,30.066666666664851,45.09999999999728]
[null,"15:03:00",15.05,30.099999999998161,45.149999999997242]
[null,"15:04:00",15.07,30.133333333331521,45.199999999997281]
[null,"15:05:00",15.08,30.166666666664831,45.249999999997243]
[null,"15:06:00",15.1,30.199999999998145,45.299999999997219]
[null,"15:07:00",15.12,30.233333333331505,45.349999999997259]
[null,"15:08:00",15.13,30.266666666664818,45.399999999997227]
[null,"15:09:00",15.15,30.299999999998178,45.449999999997267]
[null,"15:10:00",15.17,30.333333333331488,45.499999999997229]
[null,"15:11:00",15.18,30.366666666664798,45.549999999997198]
[null,"15:12:00",15.2,30.399999999998158,45.599999999997237]
[null,"15:13:00",15.22,30.433333333331472,45.649999999997206]
[null,"15:14:00",15.23,30.466666666664832,45.699999999997246]
[null,"15:15:00",15.25,30.499999999998145,45.749999999997215]
[null,"15:16:00",15.27,30.533333333331456,45.799999999997183]
[null,"15:17:00",15.28,30.566666666664815,45.849999999997223]
[null,"15:18:00",15.3,30.599999999998126,45.899999999997192]
[null,"15:19:00",15.32,30.633333333331485,45.949999999997232]
[null,"15:20:00",15.33,30.666666666664799,45.9999999999972]
[null,"15:21:00",15.35,30.699999999998159,46.04999999999724]
[null,"15:22:00",15.37,30.733333333331473,46.099999999997209]
[null,"15:23:00",15.38,30.766666666664783,46.149999999997178]
[null,"15:24:00",15.4,30.799999999998143,46.199999999997218]
[null,"15:25:00",15.42,30.833333333331453,46.249999999997179]
[null,"15:26:00",15.43,30.866666666664813,46.299999999997219]
[null,"15:27:00",15.45,30.899999999998126,46.349999999997188]
[null,"15:28:00",15.47,30.93333333333144,46.399999999997164]
[null,"15:29:00",15.48,30.9666666666648,46.449999999997203]
[null,"15:30:00",15.5,30.99999999999811,46.499999999997165]
[null,"15:31:00",15.52,31.03333333333147,46.549999999997205]
[null,"15:32:00",15.53,31.06666666666478,46.599999999997166]
[null,"15:33:00",15.55,31.099999999998094,46.649999999997142]
[null,"15:34:00",15.57,31.133333333331453,46.699999999997182]
[null,"15:35:00",15.58,31.166666666664767,46.749999999997151]
[null,"15:36:00",15.6,31.199999999998131,46.799999999997198]
[null,"15:37:00",15.62,31.233333333331444,46.849999999997166]
[null,"15:38:00",15.63,31.266666666664754,46.899999999997135]
[null,"15:39:00",15.65,31.299999999998114,46.949999999997175]
[null,"15:40:00",15.67,31.333333333331424,46.999999999997137]
[null,"15:41:00",15.68,31.366666666664738,47.049999999997105]
[null,"15:42:00",15.7,31.399999999998098,47.099999999997145]
[null,"15:43:00",15.72,31.433333333331412,47.149999999997121]
[null,"15:44:00",15.73,31.466666666664771,47.199999999997161]
[null,"15:45:00",15.75,31.499999999998082,47.249999999997122]
[null,"15:46:00",15.77,31.533333333331392,47.299999999997084]
[null,"15:47:00",15.78,31.566666666664752,47.349999999997124]
[null,"15:48:00",15.8,31.599999999998065,47.3999999999971]
[null,"15:49:00",15.82,31.633333333331425,47.449999999997139]
[null,"15:50:00",15.83,31.666666666664739,47.499999999997108]
[null,"15:51:00",15.85,31.699999999998049,47.54999999999707]
[null,"15:52:00",15.87,31.733333333331409,47.59999999999711]
[null,"15:53:00",15.88,31.766666666664719,47.649999999997078]
[null,"15:54:00",15.9,31.799999999998079,47.699999999997118]
[null,"15:55:00",15.92,31.833333333331392,47.749999999997087]
[null,"15:56:00",15.93,31.866666666664752,47.799999999997127]
[null,"15:57:00",15.95,31.899999999998066,47.849999999997095]
[null,"15:58:00",15.97,31.933333333331376,47.899999999997064]
[null,"15:59:00",15.98,31.966666666664736,47.949999999997104]
[null,"16:00:00",16,31.999999999998046,47.999999999997073]
[null,"16:01:00",16.02,32.033333333331406,48.049999999997112]
[null,"16:02:00",16.03,32.066666666664716,48.099999999997074]
[null,"16:03:00",16.05,32.099999999998033,48.14999999999705]
[null,"16:04:00",16.07,32.133333333331393,48.19999999999709]
[null,"16:05:00",16.079999999999998,32.166666666664703,48.249999999997058]
[null,"16:06:00",16.100000000000001,32.199999999998063,48.299999999997098]
[null,"16:07:00",16.12,32.233333333331373,48.34999999999706]
[null,"16:08:00",16.13,32.26666666666469,48.399999999997036]
[null,"16:09:00",16.149999999999999,32.29999999999805,48.449999999997075]
[null,"16:10:00",16.170000000000002,32.33333333333136,48.499999999997044]
[null,"16:11:00",16.18,32.36666666666472,48.549999999997084]
[null,"16:12:00",16.2,32.39999999999803,48.599999999997046]
[null,"16:13:00",16.22,32.43333333333134,48.649999999997007]
[null,"16:14:00",16.23,32.4666666666647,48.699999999997047]
[null,"16:15:00",16.25,32.49999999999801,48.749999999997016]
[null,"16:16:00",16.27,32.53333333333137,48.799999999997056]
[null,"16:17:00",16.28,32.566666666664688,48.849999999997031]
[null,"16:18:00",16.3,32.599999999997998,48.899999999996993]
[null,"16:19:00",16.32,32.633333333331358,48.949999999997033]
[null,"16:20:00",16.329999999999998,32.666666666664668,48.999999999997002]
[null,"16:21:00",16.350000000000001,32.699999999998035,49.049999999997056]
[null,"16:22:00",16.37,32.733333333331345,49.099999999997017]
[null,"16:23:00",16.38,32.766666666664662,49.149999999996993]
[null,"16:24:00",16.399999999999999,32.799999999998022,49.199999999997033]
[null,"16:25:00",16.420000000000002,32.833333333331332,49.249999999997002]
[null,"16:26:00",16.43,32.866666666664642,49.299999999996963]
[null,"16:27:00",16.45,32.899999999998002,49.349999999997003]
[null,"16:28:00",16.47,32.933333333331312,49.399999999996965]
[null,"16:29:00",16.48,32.966666666664672,49.449999999997004]
[null,"16:30:00",16.5,32.999999999997982,49.499999999996973]
[null,"16:31:00",16.52,33.033333333331299,49.549999999996949]
[null,"16:32:00",16.53,33.066666666664659,49.599999999996989]
[null,"16:33:00",16.55,33.099999999997969,49.64999999999695]
[null,"16:34:00",16.57,33.133333333331329,49.69999999999699]
[null,"16:35:00",16.579999999999998,33.166666666664639,49.749999999996959]
[null,"16:36:00",16.600000000000001,33.199999999997956,49.799999999996935]
[null,"16:37:00",16.62,33.233333333331316,49.849999999996975]
[null,"16:38:00",16.63,33.266666666664626,49.899999999996936]
[null,"16:39:00",16.649999999999999,33.299999999997986,49.949999999996976]
[null,"16:40:00",16.670000000000002,33.333333333331296,49.999999999996945]
[null,"16:41:00",16.68,33.366666666664656,50.049999999996984]
[null,"16:42:00",16.7,33.399999999997966,50.099999999996953]
[null,"16:43:00",16.72,33.433333333331277,50.149999999996915]
[null,"16:44:00",16.73,33.466666666664636,50.199999999996955]
[null,"16:45:00",16.75,33.499999999997954,50.24999999999693]
[null,"16:46:00",16.77,33.533333333331313,50.29999999999697]
[null,"16:47:00",16.78,33.566666666664624,50.349999999996939]
[null,"16:48:00",16.8,33.599999999997934,50.399999999996901]
[null,"16:49:00",16.82,33.633333333331294,50.44999999999694]
[null,"16:50:00",16.829999999999998,33.666666666664611,50.499999999996916]
[null,"16:51:00",16.850000000000001,33.699999999997971,50.549999999996956]
[null,"16:52:00",16.87,33.733333333331281,50.599999999996925]
[null,"16:53:00",16.88,33.766666666664591,50.649999999996886]
[null,"16:54:00",16.899999999999999,33.799999999997951,50.699999999996926]
[null,"16:55:00",16.920000000000002,33.833333333331261,50.749999999996888]
[null,"16:56:00",16.93,33.866666666664621,50.799999999996928]
[null,"16:57:00",16.95,33.899999999997931,50.849999999996896]
[null,"16:58:00",16.97,33.933333333331248,50.899999999996872]
[null,"16:59:00",16.98,33.966666666664608,50.949999999996912]
[null,"17:00:00",17,33.999999999997918,50.999999999996874]
[null,"17:01:00",17.02,34.033333333331278,51.049999999996913]
[null,"17:02:00",17.03,34.066666666664588,51.099999999996882]
[null,"17:03:00",17.05,34.099999999997905,51.149999999996858]
[null,"17:04:00",17.07,34.133333333331265,51.199999999996898]
[null,"17:05:00",17.079999999999998,34.166666666664575,51.249999999996859]
[null,"17:06:00",17.100000000000001,34.199999999997935,51.299999999996899]
[null,"17:07:00",17.12,34.233333333331252,51.349999999996882]
[null,"17:08:00",17.13,34.266666666664563,51.399999999996844]
[null,"17:09:00",17.149999999999999,34.299999999997922,51.449999999996884]
[null,"17:10:00",17.170000000000002,34.333333333331232,51.499999999996845]
[null,"17:11:00",17.18,34.366666666664543,51.549999999996814]
[null,"17:12:00",17.2,34.399999999997902,51.599999999996854]
[null,"17:13:00",17.22,34.43333333333122,51.64999999999683]
[null,"17:14:00",17.23,34.46666666666458,51.699999999996869]
[null,"17:15:00",17.25,34.49999999999789,51.749999999996831]
[null,"17:16:00",17.27,34.53333333333125,51.799999999996871]
[null,"17:17:00",17.28,34.56666666666456,51.84999999999684]
[null,"17:18:00",17.3,34.599999999997877,51.899999999996815]
[null,"17:19:00",17.32,34.633333333331237,51.949999999996855]
[null,"17:20:00",17.329999999999998,34.666666666664547,51.999999999996817]
[null,"17:21:00",17.350000000000001,34.699999999997907,52.049999999996857]
[null,"17:22:00",17.37,34.733333333331217,52.099999999996825]
[null,"17:23:00",17.38,34.766666666664527,52.149999999996794]
[null,"17:24:00",17.399999999999999,34.799999999997887,52.199999999996834]
[null,"17:25:00",17.420000000000002,34.833333333331197,52.249999999996795]
[null,"17:26:00",17.43,34.866666666664557,52.299999999996835]
[null,"17:27:00",17.45,34.899999999997874,52.349999999996811]
[null,"17:28:00",17.47,34.933333333331184,52.39999999999678]
[null,"17:29:00",17.48,34.966666666664544,52.44999999999682]
[null,"17:30:00",17.5,34.999999999997854,52.499999999996781]
[null,"17:31:00",17.52,35.033333333331214,52.549999999996821]
[null,"17:32:00",17.53,35.066666666664531,52.599999999996797]
[null,"17:33:00",17.55,35.099999999997841,52.649999999996766]
[null,"17:34:00",17.57,35.133333333331201,52.699999999996805]
[null,"17:35:00",17.579999999999998,35.166666666664511,52.749999999996767]
[null,"17:36:00",17.600000000000001,35.199999999997871,52.799999999996807]
[null,"17:37:00",17.62,35.233333333331181,52.849999999996768]
[null,"17:38:00",17.63,35.266666666664491,52.899999999996737]
[null,"17:39:00",17.649999999999999,35.299999999997851,52.949999999996777]
[null,"17:40:00",17.670000000000002,35.333333333331169,52.999999999996753]
[null,"17:41:00",17.68,35.366666666664528,53.049999999996793]
[null,"17:42:00",17.7,35.399999999997839,53.099999999996754]
[null,"17:43:00",17.72,35.433333333331149,53.149999999996723]
[null,"17:44:00",17.73,35.466666666664509,53.199999999996763]
[null,"17:45:00",17.75,35.499999999997826,53.249999999996739]
[null,"17:46:00",17.77,35.533333333331186,53.299999999996778]
[null,"17:47:00",17.78,35.566666666664496,53.34999999999674]
[null,"17:48:00",17.8,35.599999999997806,53.399999999996709]
[null,"17:49:00",17.82,35.633333333331166,53.449999999996749]
[null,"17:50:00",17.829999999999998,35.666666666664476,53.499999999996717]
[null,"17:51:00",17.850000000000001,35.699999999997836,53.549999999996757]
[null,"17:52:00",17.87,35.733333333331146,53.599999999996719]
[null,"17:53:00",17.88,35.766666666664463,53.649999999996695]
[null,"17:54:00",17.899999999999999,35.799999999997823,53.699999999996734]
[null,"17:55:00",17.920000000000002,35.83333333333114,53.74999999999671]
[null,"17:56:00",17.93,35.86666666666445,53.799999999996672]
[null,"17:57:00",17.95,35.89999999999781,53.849999999996712]
[null,"17:58:00",17.97,35.93333333333112,53.89999999999668]
[null,"17:59:00",17.98,35.96666666666448,53.94999999999672]
[null,"18:00:00",18,35.999999999997797,53.999999999996696]
[null,"18:01:00",18.02,36.033333333331157,54.049999999996736]
[null,"18:02:00",18.03,36.066666666664467,54.099999999996697]
[null,"18:03:00",18.05,36.099999999997777,54.149999999996666]
[null,"18:04:00",18.07,36.133333333331137,54.199999999996706]
[null,"18:05:00",18.079999999999998,36.166666666664447,54.249999999996675]
[null,"18:06:00",18.100000000000001,36.199999999997807,54.299999999996714]
[null,"18:07:00",18.12,36.233333333331117,54.349999999996676]
[null,"18:08:00",18.13,36.266666666664435,54.399999999996652]
[null,"18:09:00",18.149999999999999,36.299999999997794,54.449999999996692]
[null,"18:10:00",18.170000000000002,36.333333333331105,54.49999999999666]
[null,"18:11:00",18.18,36.366666666664464,54.5499999999967]
[null,"18:12:00",18.2,36.399999999997775,54.599999999996662]
[null,"18:13:00",18.22,36.433333333331092,54.649999999996638]
[null,"18:14:00",18.23,36.466666666664452,54.699999999996678]
[null,"18:15:00",18.25,36.499999999997762,54.749999999996646]
[null,"18:16:00",18.27,36.533333333331122,54.799999999996686]
[null,"18:17:00",18.28,36.566666666664432,54.849999999996648]
[null,"18:18:00",18.3,36.599999999997742,54.899999999996609]
[null,"18:19:00",18.32,36.633333333331102,54.949999999996649]
[null,"18:20:00",18.329999999999998,36.666666666664412,54.999999999996618]
[null,"18:21:00",18.350000000000001,36.699999999997772,55.049999999996658]
[null,"18:22:00",18.37,36.733333333331089,55.099999999996633]
[null,"18:23:00",18.38,36.766666666664399,55.149999999996595]
[null,"18:24:00",18.399999999999999,36.799999999997759,55.199999999996635]
[null,"18:25:00",18.420000000000002,36.833333333331069,55.249999999996604]
[null,"18:26:00",18.43,36.866666666664429,55.299999999996643]
[null,"18:27:00",18.45,36.899999999997746,55.349999999996619]
[null,"18:28:00",18.47,36.933333333331056,55.399999999996581]
[null,"18:29:00",18.48,36.966666666664416,55.449999999996621]
[null,"18:30:00",18.5,36.999999999997726,55.499999999996589]
[null,"18:31:00",18.52,37.033333333331086,55.549999999996629]
[null,"18:32:00",18.53,37.066666666664396,55.599999999996598]
[null,"18:33:00",18.55,37.099999999997706,55.64999999999656]
[null,"18:34:00",18.57,37.133333333331066,55.699999999996599]
[null,"18:35:00",18.579999999999998,37.166666666664383,55.749999999996575]
[null,"18:36:00",18.600000000000001,37.199999999997743,55.799999999996615]
[null,"18:37:00",18.62,37.233333333331053,55.849999999996584]
[null,"18:38:00",18.63,37.266666666664364,55.899999999996545]
[null,"18:39:00",18.649999999999999,37.299999999997731,55.949999999996592]
[null,"18:40:00",18.670000000000002,37.333333333331041,55.999999999996561]
[null,"18:41:00",18.68,37.366666666664401,56.049999999996601]
[null,"18:42:00",18.7,37.399999999997718,56.099999999996577]
[null,"18:43:00",18.72,37.433333333331028,56.149999999996538]
[null,"18:44:00",18.73,37.466666666664388,56.199999999996578]
[null,"18:45:00",18.75,37.499999999997698,56.249999999996547]
[null,"18:46:00",18.77,37.533333333331058,56.299999999996587]
[null,"18:47:00",18.78,37.566666666664368,56.349999999996555]
[null,"18:48:00",18.8,37.599999999997678,56.399999999996517]
[null,"18:49:00",18.82,37.633333333331038,56.449999999996557]
[null,"18:50:00",18.829999999999998,37.666666666664355,56.499999999996533]
[null,"18:51:00",18.850000000000001,37.699999999997715,56.549999999996572]
[null,"18:52:00",18.87,37.733333333331025,56.599999999996541]
[null,"18:53:00",18.88,37.766666666664335,56.649999999996503]
[null,"18:54:00",18.899999999999999,37.799999999997695,56.699999999996542]
[null,"18:55:00",18.920000000000002,37.833333333331012,56.749999999996518]
[null,"18:56:00",18.93,37.866666666664372,56.799999999996558]
[null,"18:57:00",18.95,37.899999999997682,56.849999999996527]
[null,"18:58:00",18.97,37.933333333330992,56.899999999996488]
[null,"18:59:00",18.98,37.966666666664352,56.949999999996528]

{"sheet":"Hébergement","index":11,"n_rows":31,"n_cols":6,"rows_kept":31,"cut":false,"hidden":true,"merged":[[8,1,8,5],[31,1,34,5]]}
[]
[]
[null,null,null,null,null,{"$f":"Général!L3","v":0}]
[]
[]
[]
[]
[]
[null,{"$f":"IF(OR(Général!J79=2,'Calculs choix indemnité'!A10<'Calculs choix indemnité'!A12),\n\"ATTENTION: Vous ne pouvez demander le remboursement des frais d'hébergement.\",\n\"\")","v":{"$error":"#VALUE!"}}]
[]
[null,"Remplir les cellules jaunes seulement, si votre transport comprend un coucher."]
[]
[]
[null,null,null,{"$f":"CONCATENATE(Général!G9,\" \",Général!J9)","v":" "},null,{"$f":"CONCATENATE(Général!G10,\" \",Général!J10)","v":" "}]
[]
[]
[null,"Lieu du coucher",null,null,null,{"$f":"D17","v":0}]
[]
[null,"Période le l'année",null,null,null,{"$f":"D19","v":0}]
[null,"Montant maximal pouvant être remboursé excluant toutes taxes",null,{"$f":"IFERROR(INDEX(Divers!$G$8:$H$16,MATCH(D17,Divers!$F$8:$F$16,0),MATCH(D19,Divers!$G$7:$H$7,0)),\"\")","v":""},null,{"$f":"IFERROR(INDEX(Divers!$G$8:$H$16,MATCH(F17,Divers!$F$8:$F$16,0),MATCH(F19,Divers!$G$7:$H$7,0)),\"\")","v":""}]
[null,"Coût du coucher inscrit sur la facture avant toutes taxes"]
[]
[null,"Taxes sur l'hébergement inscrit sur la facture"]
[]
[null,"Montant maximal pouvant être remboursé excluant TPS et TVQ",null,{"$f":"IF(D20<D21,D20+D23,D21+D23)","v":0},null,{"$f":"IF(F20<F21,F20+F23,F21+F23)","v":0}]
[]
[null,null,null,null,null,{"$f":"IFERROR(D25+F25,\"\")","v":0}]
[]
[]
[]
[null,"Commentaires:"]

{"sheet":"Repas","index":12,"n_rows":78,"n_cols":15,"rows_kept":78,"cut":false,"hidden":true,"merged":[[13,3,13,5],[16,13,16,14],[13,8,13,10],[78,1,80,12],[48,13,48,14],[46,1,46,12]]}
[]
[]
[]
[null,null,null,null,null,null,null,null,null,null,null,{"$f":"Général!L3","v":0}]
[]
[]
[]
[]
[]
[]
[null,"Remplir les cellules jaunes seulement. Inscrire le coût des repas sans taxes, et les pourboires séparément."]
[]
[]
[null,null,null,{"$f":"CONCATENATE(Général!G9,\" \",Général!J9)","v":" "},null,null,null,null,{"$f":"CONCATENATE(Général!G10,\" \",Général!J10)","v":" "}]
[]
[]
[null,"Déjeuner",null,"Coûts réels",null,"Coûts admissibles",null,null,"Coûts réels",null,"Coûts admissibles",null,"Total coûts admissibles","colonnes pour pourboire maximum admissible A CACHER"]
[null,null,null,null,null,null,null,null,null,null,null,null,null,"trudeau","simars"]
[null,"Coût avant taxes",null,null,null,{"$f":"IF($D19+$D20<'Calculs repas'!$D$12,$D19,'Calculs repas'!$D$7)","v":0},null,null,null,null,{"$f":"IF($I19+$I20<'Calculs repas'!$D$12,$I19,'Calculs repas'!$D$7)","v":0},null,{"$f":"F19+K19","v":0},{"$f":"$F19+$F20","v":0},{"$f":"$K19+$K20","v":0}]
[null,"Taxes",null,{"$f":"ROUND(D19*TAUX!$C$61,2)+ROUND(D19*TAUX!$C$62,2)","v":0},null,{"$f":"IF($D19+$D20<'Calculs repas'!$D$12,$D20,'Calculs repas'!$D$10)","v":0},null,null,{"$f":"ROUND(I19*TAUX!$C$61,2)+ROUND(I19*TAUX!$C$62,2)","v":0},null,{"$f":"IF($I19+$I20<'Calculs repas'!$D$12,$I20,'Calculs repas'!$D$10)","v":0},null,{"$f":"F20+K20","v":0},{"$f":"$D21","v":0},{"$f":"$I21","v":0}]
[null,"Pourboire",null,null,null,{"$f":"IF($N20<$N21,$N20,$N21)","v":0},null,null,null,null,{"$f":"IF($O20<$O21,$O20,$O21)","v":0},null,{"$f":"F21+K21","v":0},{"$f":"IF('Calculs repas'!$D$12-$N19>0,'Calculs repas'!$D$12-$N19,)","v":14.95},{"$f":"IF('Calculs repas'!$D$12-$O19>0,'Calculs repas'!$D$12-$O19,)","v":14.95}]
[null,"Total déjeuner",null,{"$f":"SUM(D19:D21)","v":0},null,{"$f":"SUM(F19:F21)","v":0},null,null,{"$f":"SUM(I19:I21)","v":0},null,{"$f":"SUM(K19:K21)","v":0},null,{"$f":"F22+K22","v":0}]
[]
[]
[]
[null,"Dîner",null,"Coûts réels",null,"Coûts admissibles",null,null,"Coûts réels",null,"Coûts admissibles",null,"Total coûts admissibles"]
[]
[null,"Coût avant taxes",null,null,null,{"$f":"IF($D28+$D29<'Calculs repas'!$F$12,$D28,'Calculs repas'!$F$7)","v":0},null,null,null,null,{"$f":"IF($I28+$I29<'Calculs repas'!$F$12,$I28,'Calculs repas'!$F$7)","v":0},null,{"$f":"F28+K28","v":0},{"$f":"$F28+$F29","v":0},{"$f":"$K28+$K29","v":0}]
[null,"Taxes",null,{"$f":"ROUND(D28*TAUX!$C$61,2)+ROUND(D28*TAUX!$C$62,2)","v":0},null,{"$f":"IF($D28+$D29<'Calculs repas'!$F$12,$D29,'Calculs repas'!$F$10)","v":0},null,null,{"$f":"ROUND(I28*TAUX!$C$61,2)+ROUND(I28*TAUX!$C$62,2)","v":0},null,{"$f":"IF($I28+$I29<'Calculs repas'!$F$12,$I29,'Calculs repas'!$F$10)","v":0},null,{"$f":"F29+K29","v":0},{"$f":"$D30","v":0},{"$f":"$I30","v":0}]
[null,"Pourboire",null,null,null,{"$f":"IF($N29<$N30,$N29,$N30)","v":0},null,null,null,null,{"$f":"IF($O29<$O30,$O29,$O30)","v":0},null,{"$f":"F30+K30","v":0},{"$f":"IF('Calculs repas'!$F$12-$N28>0,'Calculs repas'!$F$12-$N28,)","v":20.580524999999998},{"$f":"IF('Calculs repas'!$F$12-$O28>0,'Calculs repas'!$F$12-$O28,)","v":20.580524999999998}]
[null,"Total déjeuner",null,{"$f":"SUM(D28:D30)","v":0},null,{"$f":"SUM(F28:F30)","v":0},null,null,{"$f":"SUM(I28:I30)","v":0},null,{"$f":"SUM(K28:K30)","v":0},null,{"$f":"F31+K31","v":0}]
[]
[]
[]
[null,"Souper",null,"Coûts réels",null,"Coûts admissibles",null,null,"Coûts réels",null,"Coûts admissibles",null,"Total coûts admissibles"]
[]
[null,"Coût avant taxes",null,null,null,{"$f":"IF($D37+$D38<'Calculs repas'!$H$12,$D37,'Calculs repas'!$H$7)","v":0},null,null,null,null,{"$f":"IF($I37+$I38<'Calculs repas'!$H$12,$I37,'Calculs repas'!$H$7)","v":0},null,{"$f":"F37+K37","v":0},{"$f":"$F37+$F38","v":0},{"$f":"$K37+$K38","v":0}]
[null,"Taxes",null,{"$f":"D37*ROUNDUP(TAUX!D63,3)","v":0},null,{"$f":"IF($D37+$D38<'Calculs repas'!$H$12,\n$D38,\n'Calculs repas'!$H$10)","v":0},null,null,{"$f":"IF(I37=\"18,70 $\",[2]calculsrepas!$H$10,I37*TAUX!$C$63)","v":0},null,{"$f":"IF($I37+$I38<'Calculs repas'!$H$12,$I38,'Calculs repas'!$H$10)","v":0},null,{"$f":"F38+K38","v":0},{"$f":"$D39","v":0},{"$f":"$I39","v":0}]
[null,"Pourboire",null,null,null,{"$f":"IF($N38<$N39,$N38,$N39)","v":0},null,null,null,null,{"$f":"IF($O38<$O39,$O38,$O39)","v":0},null,{"$f":"F39+K39","v":0},{"$f":"IF('Calculs repas'!$H$12-$N37>0,'Calculs repas'!$H$12-$N37,)","v":31.04},{"$f":"IF('Calculs repas'!$H$12-$O37>0,'Calculs repas'!$H$12-$O37,)","v":31.04}]
[null,"Total déjeuner",null,{"$f":"SUM(D37:D39)","v":0},null,{"$f":"SUM(F37:F39)","v":0},null,null,{"$f":"SUM(I37:I39)","v":0},null,{"$f":"SUM(K37:K39)","v":0},null,{"$f":"F40+K40","v":0}]
[]
[null,null,null,null,null,null,null,null,null,null,"Repas (section dépenses taxables remboursables)",null,{"$f":"M19+M28+M37","v":0}]
[null,null,null,null,null,null,null,null,null,null,"Taxes",null,{"$f":"M20+M29+M38","v":0}]
[null,null,null,null,null,null,null,null,null,null,"Pourboires (section dépenses non taxables remboursables)",null,{"$f":"M21+M30+M39","v":0}]
[null,null,null,null,null,null,null,null,null,null,"Total",null,{"$f":"SUM(M42:M44)","v":0}]
[]
[null,"REPAS AU-DELÀ DES PREMIERS 24 HEURES SEULEMENT"]
[]
[null,"Déjeuner",null,"Coûts réels",null,"Coûts admissibles",null,null,"Coûts réels",null,"Coûts admissibles",null,"Total coûts admissibles","colonnes pour pourboire maximum admissible A CACHER"]
[null,null,null,null,null,null,null,null,null,null,null,null,null,"trudeau","simars"]
[null,"Coût avant taxes",null,null,null,{"$f":"IF($D51+$D52<'Calculs repas'!$D$12,$D51,'Calculs repas'!$D$7)","v":0},null,null,null,null,{"$f":"IF($I51+$I52<'Calculs repas'!$D$12,$I51,'Calculs repas'!$D$7)","v":0},null,{"$f":"F51+K51","v":0},{"$f":"$F51+$F52","v":0},{"$f":"$K51+$K52","v":0}]
[null,"Taxes",null,{"$f":"ROUND(D51*TAUX!$C$61,2)+ROUND(D51*TAUX!$C$62,2)","v":0},null,{"$f":"IF($D51+$D52<'Calculs repas'!$D$12,$D52,'Calculs repas'!$D$10)","v":0},null,null,{"$f":"ROUND(I51*TAUX!$C$61,2)+ROUND(I51*TAUX!$C$62,2)","v":0},null,{"$f":"IF($I51+$I52<'Calculs repas'!$D$12,$I52,'Calculs repas'!$D$10)","v":0},null,{"$f":"F52+K52","v":0},{"$f":"$D53","v":0},{"$f":"$I53","v":0}]
[null,"Pourboire",null,null,null,{"$f":"IF($N52<$N53,$N52,$N53)","v":0},null,null,null,null,{"$f":"IF($O52<$O53,$O52,$O53)","v":0},null,{"$f":"F53+K53","v":0},{"$f":"IF('Calculs repas'!$D$12-$N51>0,'Calculs repas'!$D$12-$N51,)","v":14.95},{"$f":"IF('Calculs repas'!$D$12-$O51>0,'Calculs repas'!$D$12-$O51,)","v":14.95}]
[null,"Total déjeuner",null,{"$f":"SUM(D51:D53)","v":0},null,{"$f":"SUM(F51:F53)","v":0},null,null,{"$f":"SUM(I51:I53)","v":0},null,{"$f":"SUM(K51:K53)","v":0},null,{"$f":"F54+K54","v":0}]
[]
[]
[]
[null,"Dîner",null,"Coûts réels",null,"Coûts admissibles",null,null,"Coûts réels",null,"Coûts admissibles",null,"Total coûts admissibles"]
[]
[null,"Coût avant taxes",null,null,null,{"$f":"IF($D60+$D61<'Calculs repas'!$F$12,$D60,'Calculs repas'!$F$7)","v":0},null,null,null,null,{"$f":"IF($I60+$I61<'Calculs repas'!$F$12,$I60,'Calculs repas'!$F$7)","v":0},null,{"$f":"F60+K60","v":0},{"$f":"$F60+$F61","v":0},{"$f":"$K60+$K61","v":0}]
[null,"Taxes",null,{"$f":"ROUND(D60*TAUX!$C$61,2)+ROUND(D60*TAUX!$C$62,2)","v":0},null,{"$f":"IF($D60+$D61<'Calculs repas'!$F$12,$D61,'Calculs repas'!$F$10)","v":0},null,null,{"$f":"ROUND(I60*TAUX!$C$61,2)+ROUND(I60*TAUX!$C$62,2)","v":0},null,{"$f":"IF($I60+$I61<'Calculs repas'!$F$12,$I61,'Calculs repas'!$F$10)","v":0},null,{"$f":"F61+K61","v":0},{"$f":"$D62","v":0},{"$f":"$I62","v":0}]
[null,"Pourboire",null,null,null,{"$f":"IF($N61<$N62,$N61,$N62)","v":0},null,null,null,null,{"$f":"IF($O61<$O62,$O61,$O62)","v":0},null,{"$f":"F62+K62","v":0},{"$f":"IF('Calculs repas'!$F$12-$N60>0,'Calculs repas'!$F$12-$N60,)","v":20.580524999999998},{"$f":"IF('Calculs repas'!$F$12-$O60>0,'Calculs repas'!$F$12-$O60,)","v":20.580524999999998}]
[null,"Total déjeuner",null,{"$f":"SUM(D60:D62)","v":0},null,{"$f":"SUM(F60:F62)","v":0},null,null,{"$f":"SUM(I60:I62)","v":0},null,{"$f":"SUM(K60:K62)","v":0},null,{"$f":"F63+K63","v":0}]
[]
[]
[]
[null,"Souper",null,"Coûts réels",null,"Coûts admissibles",null,null,"Coûts réels",null,"Coûts admissibles",null,"Total coûts admissibles"]
[]
[null,"Coût avant taxes",null,null,null,{"$f":"IF($D69+$D70<'Calculs repas'!$H$12,$D69,'Calculs repas'!$H$7)","v":0},null,null,null,null,{"$f":"IF($I69+$I70<'Calculs repas'!$H$12,$I69,'Calculs repas'!$H$7)","v":0},null,{"$f":"F69+K69","v":0},{"$f":"$F69+$F70","v":0},{"$f":"$K69+$K70","v":0}]
[null,"Taxes",null,{"$f":"D69*ROUNDUP(TAUX!D63,3)","v":0},null,{"$f":"IF($D69+$D70<'Calculs repas'!$H$12,$D70,'Calculs repas'!$H$10)","v":0},null,null,{"$f":"IF(I69=\"18,70 $\",[2]calculsrepas!$H$10,I69*TAUX!$C$63)","v":0},null,{"$f":"IF($I69+$I70<'Calculs repas'!$H$12,$I70,'Calculs repas'!$H$10)","v":0},null,{"$f":"F70+K70","v":0},{"$f":"$D71","v":0},{"$f":"$I71","v":0}]
[null,"Pourboire",null,null,null,{"$f":"IF($N70<$N71,$N70,$N71)","v":0},null,null,null,null,{"$f":"IF($O70<$O71,$O70,$O71)","v":0},null,{"$f":"F71+K71","v":0},{"$f":"IF('Calculs repas'!$H$12-$N69>0,'Calculs repas'!$H$12-$N69,)","v":31.04},{"$f":"IF('Calculs repas'!$H$12-$O69>0,'Calculs repas'!$H$12-$O69,)","v":31.04}]
[null,"Total déjeuner",null,{"$f":"SUM(D69:D71)","v":0},null,{"$f":"SUM(F69:F71)","v":0},null,null,{"$f":"SUM(I69:I71)","v":0},null,{"$f":"SUM(K69:K71)","v":0},null,{"$f":"F72+K72","v":0}]
[]
[]
[null,null,null,null,null,null,null,null,null,null,"Repas (section dépenses taxables remboursables)",null,{"$f":"M51+M60+M69","v":0}]
[null,null,null,null,null,null,null,null,null,null,"Taxes",null,{"$f":"M52+M61+M70","v":0}]
[null,null,null,null,null,null,null,null,null,null,"Pourboires (section dépenses non taxables remboursables)",null,{"$f":"M53+M62+M71","v":0}]
[null,"Commentaires:",null,null,null,null,null,null,null,null,"Total",null,{"$f":"SUM(M75:M77)","v":0}]

{"sheet":"Garde","index":13,"n_rows":36,"n_cols":11,"rows_kept":36,"cut":false,"hidden":true,"merged":[[32,1,33,10],[36,1,41,10]]}
[]
[]
[]
[null,null,null,null,null,null,null,null,null,null,{"$f":"Général!L3","v":0}]
[]
[]
[]
[null,"Remplir les cellules jaunes seulement."]
[null,null,null,"Début",null,"Fin","date en texte et heure en texte","date en texte et heure en texte","Début / Fin","Durée en heures et minutes","Nombre de périodes"]
[]
[]
[null,"Date:",null,null,null,null,{"$f":"IF(D12=\"\",\"\",(TEXT(D12,\"aaaa-mm-jj\")))","v":""},{"$f":"IF(F12=\"\",\"\",TEXT(F12,\"aaaa-mm-jj\"))","v":""},{"$f":"G12&\" \"&G14","v":" "}]
[]
[null,"Heure:",null,null,null,null,{"$f":"IF(D14=\"\",\"\",TEXT(D14,\"hh:mm\"))","v":""},{"$f":"IF(G14=\"\",\"\",TEXT(F14,\"hh:mm\"))","v":""},{"$f":"H12&\" \"&H14","v":" "},{"$f":"IFERROR(IF(I14-I12>=0,I14-I12,\"\"),\"\")","v":""},{"$f":"IF(J14<=Divers!$C$7,1,IF(J14<=Divers!$C$8,2,IF(J14<=Divers!$C$9,3,IF(J14<=Divers!$C$10,4,IF(J14<=Divers!$C$11,5,IF(J14<=Divers!$C$12,6,IF(J14<=Divers!$C$13,7,IF(J14<=Divers!$C$14,8))))))))","v":false}]
[]
[]
[]
[null,"Date:",null,null,null,null,{"$f":"IF(D18=\"\",\"\",(TEXT(D18,\"aaaa-mm-jj\")))","v":""},{"$f":"IF(F18=\"\",\"\",TEXT(F18,\"aaaa-mm-jj\"))","v":""},{"$f":"G18&\" \"&G20","v":" "}]
[]
[null,"Heure:",null,null,null,null,{"$f":"IF(D20=\"\",\"\",TEXT(D20,\"hh:mm\"))","v":""},{"$f":"IF(G20=\"\",\"\",TEXT(F20,\"hh:mm\"))","v":""},{"$f":"H18&\" \"&H20","v":" "},{"$f":"IFERROR(IF(I20-I18>0,I20-I18,\"\"),\"\")","v":""},{"$f":"IF(J20<=Divers!$C$7,1,IF(J20<=Divers!$C$8,2,IF(J20<=Divers!$C$9,3,IF(J20<=Divers!$C$10,4,IF(J20<=Divers!$C$11,5,IF(J20<=Divers!$C$12,6,IF(J20<=Divers!$C$13,7,IF(J20<=Divers!$C$14,8))))))))","v":false}]
[]
[]
[]
[null,"Date:",null,null,null,null,{"$f":"IF(D24=\"\",\"\",(TEXT(D24,\"aaaa-mm-jj\")))","v":""},{"$f":"IF(F24=\"\",\"\",TEXT(F24,\"aaaa-mm-jj\"))","v":""},{"$f":"G24&\" \"&G26","v":" "}]
[]
[null,"Heure:",null,null,null,null,{"$f":"IF(D26=\"\",\"\",TEXT(D26,\"hh:mm\"))","v":""},{"$f":"IF(G26=\"\",\"\",TEXT(F26,\"hh:mm\"))","v":""},{"$f":"H24&\" \"&H26","v":" "},{"$f":"IFERROR(IF(I26-I24>0,I26-I24,\"\"),\"\")","v":""},{"$f":"IF(J26<=Divers!$C$7,1,IF(J26<=Divers!$C$8,2,IF(J26<=Divers!$C$9,3,IF(J26<=Divers!$C$10,4,IF(J26<=Divers!$C$11,5,IF(J26<=Divers!$C$12,6,IF(J26<=Divers!$C$13,7,IF(J26<=Divers!$C$14,8))))))))","v":false}]
[]
[]
[null,null,null,null,null,null,null,null,null,null,{"$f":"SUM(K12:K28)","v":0}]
[null,"Format date = aaaa-mm-jj"]
[null,"Format heure = hh:mm"]
[]
[null,"Ce tableau permet d'inscrire 8 périodes de 24 heures de garde maximum. Si le nombre de jours de garde est supérieur à 8, veuillez les inscrire dans les autres cellules."]
[]
[]
[null,"Commentaires:"]

{"sheet":"Stationnement","index":14,"n_rows":22,"n_cols":5,"rows_kept":22,"cut":false,"hidden":true,"merged":[[22,1,25,4]]}
[]
[]
[]
[]
[null,null,null,null,{"$f":"Général!L3","v":0}]
[]
[]
[null,"Remplir les cellules jaunes seulement, au besoin."]
[]
[]
[]
[null,"Coût du stationnement","$"]
[]
[null,"Est-ce que le montant payé pour le stationnement comprend les taxes ?","Oui / non \n/ ne sait pas"]
[]
[null,"Coût avant taxes:",null,{"$f":"IF(D14=\"oui\",D12/1.14975,D12)","v":0}]
[null,"TPS:",null,{"$f":"D16*0.05","v":0}]
[null,"TVQ:",null,{"$f":"D16*0.09975","v":0}]
[null,"Coût incluant les taxes:",null,{"$f":"D16+D17+D18","v":0}]
[]
[]
[null,"Commentaires:"]

{"sheet":"Choix","index":15,"n_rows":23,"n_cols":14,"rows_kept":23,"cut":false,"hidden":true,"merged":[[5,1,5,2],[10,1,10,2],[23,1,23,3],[12,1,12,2],[11,1,11,2],[15,1,15,2],[13,1,13,2],[14,1,14,2],[17,2,17,3]]}
[]
[]
[]
[]
[null,null,null,{"$f":"Général!L3","v":0}]
[null,{"$f":"IFERROR(IF('Calculs choix indemnité'!A10<'Calculs choix indemnité'!A12,\n\"La durée du transport est inférieure à 12 heures. Seuls les repas, s'il y a lieu, peuvent être remboursés.\",\nIF(AND('Calculs choix indemnité'!A10>'Calculs choix indemnité'!A12,Général!J79=2),\n\"La durée du transport est supérieure à 12 heures sans coucher. \"& 'Calculs choix indemnité'!A34,\nIF(AND('Calculs choix indemnité'!A10>'Calculs choix indemnité'!A12,Général!J79=1,'Calculs choix indemnité'!A10<'Calculs choix indemnité'!A13),\n\"La durée du transport se situe entre 12 et 18 heures.\"&'Calculs choix indemnité'!A34,\nIF(AND('Calculs choix indemnité'!A10>'Calculs choix indemnité'!A12,Général!J79=1,'Calculs choix indemnité'!A10<'Calculs choix indemnité'!A14),\n\"La durée du transport se situe entre 18 et 24 heures. Vous pouvez choisir de recevoir 100 % de l'indemnité journalière ou de demander le remboursement des dépenses réelles.\",\nIF(AND('Calculs choix indemnité'!A10>'Calculs choix indemnité'!A12,Général!J79=1,'Calculs choix indemnité'!A10>'Calculs choix indemnité'!A14),\n\"La durée du transport est supérieure à 24 heures. Vous pouvez choisir de recevoir 100 % de l'indemnité journalière plus les repas pris au-delà de cette période ou de demander le remboursement des dépenses réelles.\"))))),\"\")","v":""}]
[]
[null,"Pour vous aider dans votre choix:"]
[]
[null,"Calcul de l'indemnité à laquelle vous avez droit:",null,null,null,null,null,{"$f":"Général!J85","v":0}]
[null,{"$f":"IF(B6='Calculs choix indemnité'!G21,'Calculs choix indemnité'!A33,\nIF(Choix!B6='Calculs choix indemnité'!G22,'Calculs choix indemnité'!A34,\nIF(Choix!B6='Calculs choix indemnité'!G23,'Calculs choix indemnité'!A34,\nIF(Choix!B6='Calculs choix indemnité'!G24,'Calculs choix indemnité'!A35,\nIF(Choix!B6='Calculs choix indemnité'!G25,'Calculs choix indemnité'!A36,)))))","v":0}]
[null,{"$f":"IF('Calculs choix indemnité'!A10<='Calculs choix indemnité'!A12,\"Le transport a duré moins de 12 heures, vous ne pouvez effectuer un choix.\",\nIF(Général!J79=2,\"50 % de l'indemnité soit \"&H14&\",00 $ par préposé.\",\nIF(AND(Général!J79=1,Général!L79>='Calculs choix indemnité'!A12,Général!L79<'Calculs choix indemnité'!A13),\"50 % de l'indemnité soit \"&'Calculs choix indemnité'!D16&\",00 $ par préposé:\",\nIF(AND(Général!J79=1,Général!L79>='Calculs choix indemnité'!A10,Général!L79<'Calculs choix indemnité'!A14),\"100 % de l'indemnité soit \"&'Calculs choix indemnité'!E17&\",00 $ par préposé:\",\nIF('Calculs choix indemnité'!A10>='Calculs choix indemnité'!A14,\"100 % de l'indemnité soit \"&'Calculs choix indemnité'!E17&\",00 $ par préposé:\"))\n)))","v":{"$error":"#VALUE!"}},null,{"$f":"IF('Calculs choix indemnité'!A10<='Calculs choix indemnité'!A12,0,\nIF('Calculs choix indemnité'!A10>='Calculs choix indemnité'!A14,'Calculs choix indemnité'!E17*'Calculs choix indemnité'!F17,\nIF(AND('Calculs choix indemnité'!A10>='Calculs choix indemnité'!A12,Général!H79=\"non\"),H14*'Calculs choix indemnité'!F17,\nIF(AND('Calculs choix indemnité'!A10>='Calculs choix indemnité'!A12,'Calculs choix indemnité'!A10<='Calculs choix indemnité'!A13,Général!H79=\"oui\"),'Calculs choix indemnité'!D16*'Calculs choix indemnité'!F17,\nIF(AND('Calculs choix indemnité'!A10>='Calculs choix indemnité'!A13,'Calculs choix indemnité'!A10<='Calculs choix indemnité'!A14,Général!H79=\"oui\"),'Calculs choix indemnité'!E17*'Calculs choix indemnité'!F17,)))))","v":{"$error":"#VALUE!"}},null,null,null,{"$f":"IF(L16=\"2022\",L17,IF(M16=\"2023\",M17,IF(N16=\"2024\",N17,\"\")))","v":""},null,null,null,"2022-07-01","2023-07-01","2024-07-01"]
[null,{"$f":"IF('Calculs choix indemnité'!A10>='Calculs choix indemnité'!A14,\"Plus les repas pris au-delà des premiers 24 heures, s'il y a lieu:\",\"\")","v":{"$error":"#VALUE!"}},null,{"$f":"IF('Calculs choix indemnité'!A10>='Calculs choix indemnité'!A14,\nRepas!M75,\"\")","v":{"$error":"#VALUE!"}},null,null,null,{"$f":"IF(H12=\"oui\",\"haute saison\",\"basse saison\")","v":"basse saison"},null,null,null,"2022-11-01","2023-11-01","2024-11-01"]
[null,"Total:",null,{"$f":"SUM(D12:D13)","v":{"$error":"#VALUE!"}},null,null,null,{"$f":"INDEX(TAUX!G50:H58,MATCH(H10,TAUX!F50:F58,0),MATCH(H13,TAUX!G49:H49,0))","v":{"$error":"#N/A"}},null,null,null,"2022-01-01","2023-01-01","2024-01-01"]
[null,"OU",null,null,null,null,null,null,null,null,null,"2022-12-31","2023-12-31","2024-12-31"]
[null,{"$f":"IF(AND('Calculs choix indemnité'!A10>'Calculs choix indemnité'!A12,Général!H79=\"non\"),\"Dépenses relatives aux repas (excluant les pourboires)\",\n \"Dépenses relatives aux repas (excluant les pourboires) et à l'hébergement que vous avez déjà inscrites:\")","v":{"$error":"#VALUE!"}},null,{"$f":"IF(Général!H79=\"non\",\nRepas!M42,\nRepas!M42+Repas!M75+Hébergement!F27)","v":0},null,null,null,null,null,null,null,{"$f":"IF(AND(Général!G14>=L14,Général!G14<=L15),\"2022\",\"non\")","v":"non"},{"$f":"IF(AND(Général!G14>=M14,Général!G14<=M15),\"2023\",\"non\")","v":"non"},{"$f":"IF(AND(Général!G14>=N14,Général!G14<=N15),\"2024\",\"non\")","v":"non"}]
[null,null,null,null,null,null,null,null,null,null,null,{"$f":"IF(AND(Général!G14>=Choix!L12,Général!G14<Choix!L13),\"oui\",\"non\")","v":"non"},{"$f":"IF(AND(Général!G14>=Choix!M12,Général!G14<M13),\"oui\",\"non\")","v":"non"},{"$f":"IF(AND(Général!G14>=Choix!N12,Général!G14<N13),\"oui\",\"non\")","v":"non"}]
[null,"Faites votre choix ici:"]
[]
[]
[null,null,null,{"$f":"IF(AND(C17=1,D14=0),\"Vous devez choisir Dépenses réelles\",\nIF(C17=1,D14,\nIF(AND(C17=2,D14=0),D16,\nIF(C17=2,D16))))","v":{"$error":"#VALUE!"}}]
[]
[null,"Commentaires:"]

{"sheet":"Jours fériés","index":16,"n_rows":4751,"n_cols":31,"rows_kept":4751,"cut":false,"hidden":true,"merged":[[0,1,0,3],[2,4,2,5],[0,4,0,9]]}
[null,"Liste des jours fériés 2025 à 2037",null,null,"Calendrier des jours fériés 2025 à 2037"]
[]
[null,"Calendrier 2025 à 2037","S ou FDS","F","Événement",null,2022,2023,2024,2025,2026,2027,2028,2029,2030,2031,2032,2033,2034,2035,2036,2037,2038,2039,2040,2041,2042,2043,2044,2045,2046]
[null,"2025-01-01","s","oui",null,"Jour de l'An","samedi 1er janvier 2022","dimanche 1er janvier 2023","lundi 1er janvier 2024","mercredi 1er janvier 2025","jeudi 1er janvier 2026","vendredi 1er janvier 2027","samedi 1er janvier 2028","lundi 1er janvier 2029","mardi 1er janvier 2030","mercredi 1er janvier 2031","jeudi 1er janvier 2032","samedi 1er janvier 2033","dimanche 1er janvier 2034","lundi 1er janvier 2035","mardi 1er janvier 2036","jeudi 1er janvier 2037","vendredi 1er janvier 2038","samedi 1er janvier 2039","dimanche 1er janvier 2040","mardi 1er janvier 2041","mercredi 1er janvier 2042","jeudi 1er janvier 2043","vendredi 1er janvier 2044","dimanche 1er janvier 2045","lundi 1er janvier 2046"]
[null,"2025-01-02","s","oui",null,"Lendemain du jour de l'An","dimanche 2 janvier 2022","lundi 2 janvier 2023","mardi 2 janvier 2024","jeudi 2 janvier 2025","vendredi 2 janvier 2026","samedi 2 janvier 2027","dimanche 2 janvier 2028","mardi 2 janvier 2029","lundi 2 janvier 2030","jeudi 2 janvier 2031","vendredi 2 janvier 2032","dimanche 2 janvier 2033","lundi 2 janvier 2034","mardi 2 janvier 2035","mercredi 2 janvier 2036","vendredi 2 janvier 2037","samedi 2 janvier 2038","dimanche 2 janvier 2039","lundi 2 janvier 2040","mercredi 2 janvier 2041","jeudi 2 janvier 2042","vendredi 2 janvier 2043","samedi 2 janvier 2044","lundi 2 janvier 2045","mardi 2 janvier 2046"]
[null,"2025-01-03","s",null,null,"Vendredi saint","vendredi 15 avril 2022","vendredi 7 avril 2023","vendredi 29 mars 2024","vendredi 18 avril 2025","vendredi 3 avril 2026","vendredi 26 mars 2027","vendredi 14 avril 2028","vendredi 30 mars 2029","vendredi 19 avril 2030","vendredi 11 avril 2031","vendredi 26 mars 2032","vendredi 15 avril 2033","vendredi 7 avril 2034","vendredi 23 mars 2035","vendredi 11 avril 2036","vendredi 3 avril 2037","vendredi 23 avril 2038","vendredi 8 avril 2039","vendredi 30 mars 2040","vendredi 19 avril 2041","vendredi 4 avril 2042","vendredi 27 mars 2043","vendredi 15 avril 2044","vendredi 7 avril 2045","vendredi 23 mars 2046"]
[null,"2025-01-04","fds",null,null,"Lundi de Pâques","lundi 18 avril 2022","lundi 10 avril 2023","lundi 1er avril 2024","lundi 21 avril 2025","lundi 5 avril 2026","lundi 29 mars 2027","lundi 17 avril 2028","lundi 2 avril 2029","lundi 22 avril 2030","lundi 14 avril 2031","lundi 29 mars 2032","lundi 18 avril 2033","lundi 10 avril 2034","lundi 26 mars 2035","lundi 14 avril 2036","lundi 6 avril 2037","lundi 26 avril 2038","lundi 11 avril 2039","lundi 2 avril 2040","lundi 22 avril 2041","lundi 7 avril 2042","lundi 30 mars 2043","lundi 18 avril 2044","lundi 10 avril 2045","lundi 26 mars 2046"]
[null,"2025-01-05","fds",null,null,"Journée internationale des Patriotes","lundi 23 mai 2022","lundi 22 mai 2023","lundi 20 mai 2024","lundi 19 mai 2025","lundi 18 mai 2026","lundi 24 mai 2027","lundi 22 mai 2028","lundi 21 mai 2029","lundi 20 mai 2030","lundi 19 mai 2031","lundi 24 mai 2032","lundi 23 mai 2033","lundi 22 mai 2034","lundi 21 mai 2035","lundi 19 mai 2036","lundi 18 mai 2037","lundi 24 mai 2038","lundi 23 mai 2039","lundi 21 mai 2040","lundi 20 mai 2041","lundi 19 mai 2042","lundi 18 mai 2043","lundi 23 mai 2044","lundi 22 mai 2045","lundi 21 mai 2046"]
[null,"2025-01-06","s",null,null,"Fête nationale du Québec","vendredi 24 juin 2022","samedi 24 juin 2023","lundi 24 juin 2024","mardi 24 juin 2025","mercredi 24 juin 2026","jeudi 24 juin 2027","samedi 24 juin 2028","dimanche 24 juin 2029","lundi 24 juin 2030","mardi 24 juin 2031","jeudi 24 juin 2032","vendredi 24 juin 2033","samedi 24 juin 2034","dimanche 24 juin 2035","mardi 24 juin 2036","mercredi 24 juin 2037","jeudi 24 juin 2038","vendredi 24 juin 2039","dimanche 24 juin 2040","lundi 24 juin 2041","mardi 24 juin 2042","mercredi 24 juin 2043","vendredi 24 juin 2044","samedi 24 juin 2045","dimanche 24 juin 2046"]
[null,"2025-01-07","s",null,null,"Fête du Canada","vendredi 1er juillet 2022","samedi 1er juillet 2023","lundi 1er juillet 2024","mardi 1er juillet 2025","mercredi 1er juillet 2026","jeudi 1er juillet 2027","samedi 1er juillet 2028","dimanche 1er juillet 2029","lundi 1er juillet 2030","mardi 1er juillet 2031","jeudi 1er juillet 2032","vendredi 1er juillet 2033","samedi 1er juillet 2034","dimanche 1er juillet 2035","mardi 1er juillet 2036","mercredi 1er juillet 2037","jeudi 1er juillet 2038","vendredi 1er juillet 2039","dimanche 1er juillet 2040","lundi 1er juillet 2041","mardi 1er juillet 2042","mercredi 1er juillet 2043","vendredi 1er juillet 2044","samedi 1er juillet 2045","dimanche 1er juillet 2046"]
[null,"2025-01-08","s",null,null,"Fête du Travail","lundi 5 septembre 2022","lundi 4 septembre 2023","lundi 2 septembre 2024","lundi 1er septembre 2025","lundi 7 septembre 2026","lundi 6 septembre 2027","lundi 4 septembre 2028","lundi 3 septembre 2029","lundi 2 septembre 2030","lundi 1er septembre 2031","lundi 6 septembre 2032","lundi 5 septembre 2033","lundi 4 septembre 2034","lundi 3 septembre 2035","lundi 1er septembre 2036","lundi 7 septembre 2037","lundi 6 septembre 2038","lundi 5 septembre 2039","lundi 3 septembre 2040","lundi 2 septembre 2041","lundi 1er septembre 2042","lundi 7 septembre 2043","lundi 5 septembre 2044","lundi 4 septembre 2045","lundi 3 septembre 2046"]
[null,"2025-01-09","s",null,null,"Fête de l'Action de grâces","lundi 10 octobre 2022","lundi 9 octobre 2023","lundi 14 octobre 2024","lundi 13 octobre 2025","lundi 12 octobre 2026","lundi 11 octobre 2027","lundi 9 octobre 2028","lundi 8 octobre 2029","lundi 14 octobre 2030","lundi 13 octobre 2031","lundi 11 octobre 2032","lundi 10 octobre 2033","lundi 9 octobre 2034","lundi 8 octobre 2035","lundi 13 octobre 2036","lundi 12 octobre 2037","lundi 11 octobre 2038","lundi 10 octobre 2039","lundi 8 octobre 2040","lundi 14 octobre 2041","lundi 13 octobre 2042","lundi 12 octobre 2043","lundi 10 octobre 2044","lundi 9 octobre 2045","lundi 8 octobre 2046"]
[null,"2025-01-10","s",null,null,"Veille de Noël","samedi 24 décembre 2022","dimanche 24 décembre 2023","mardi 24 décembre 2024","mercredi 24 décembre 2025","jeudi 24 décembre 2026","vendredi 24 décembre 2027","dimanche 24 décembre 2028","lundi 24 décembre 2029","mardi 24 décembre 2030","mercredi 24 décembre 2031","vendredi 24 décembre 2032","samedi 24 décembre 2033","dimanche 24 décembre 2034","lundi 24 décembre 2035","mercredi 24 décembre 2036","jeudi 24 décembre 2037","vendredi 24 décembre 2038","samedi 24 décembre 2039","lundi 24 décembre 2040","mardi 24 décembre 2041","mercredi 24 décembre 2042","jeudi 24 décembre 2043","samedi 24 décembre 2044","dimanche 24 décembre 2045","lundi 24 décembre 2046"]
[null,"2025-01-11","fds",null,null,"Noël","dimanche 25 décembre 2022","lundi 25 décembre 2023","mercredi 25 décembre 2024","jeudi 25 décembre 2025","vendredi 25 décembre 2026","samedi 25 décembre 2027","lundi 25 décembre 2028","mardi 25 décembre 2029","mercredi 25 décembre 2030","jeudi 25 décembre 2031","samedi 25 décembre 2032","dimanche 25 décembre 2033","lundi 25 décembre 2034","mardi 25 décembre 2035","jeudi 25 décembre 2036","vendredi 25 décembre 2037","samedi 25 décembre 2038","dimanche 25 décembre 2039","mardi 25 décembre 2040","mercredi 25 décembre 2041","jeudi 25 décembre 2042","vendredi 25 décembre 2043","dimanche 25 décembre 2044","lundi 25 décembre 2045","mardi 25 décembre 2046"]
[null,"2025-01-12","fds",null,null,"Lendemain de Noël","lundi 26 décembre 2022","mardi 26 décembre 2023","jeudi 26 décembre 2024","vendredi 26 décembre 2025","samedi 26 décembre 2026","dimanche 26 décembre 2027","mardi 26 décembre 2028","mercredi 26 décembre 2029","jeudi 26 décembre 2030","vendredi 26 décembre 2031","dimanche 26 décembre 2032","lundi 26 décembre 2033","mardi 26 décembre 2034","mercredi 26 décembre 2035","vendredi 26 décembre 2036","samedi 26 décembre 2037","dimanche 26 décembre 2038","lundi 26 décembre 2039","mercredi 26 décembre 2040","jeudi 26 décembre 2041","vendredi 26 décembre 2042","samedi 26 décembre 2043","lundi 26 décembre 2044","mardi 26 décembre 2045","mercredi 26 décembre 2046"]
[null,"2025-01-13","s",null,null,"Veille du Jour de l'An","samedi 31 décembre 2022","dimanche 31 décembre 2023","mardi 31 décembre 2024","mercredi 31 décembre 2025","jeudi 31 décembre 2026","vendredi 31 décembre 2027","dimanche 31 décembre 2028","lundi 31 décembre 2029","mardi 31 décembre 2030","mercredi 31 décembre 2031","vendredi 31 décembre 2032","samedi 31 décembre 2033","dimanche 31 décembre 2034","lundi 31 décembre 2035","mercredi 31 décembre 2036","jeudi 31 décembre 2037","vendredi 31 décembre 2038","samedi 31 décembre 2039","lundi 31 décembre 2040","mardi 31 décembre 2041","mercredi 31 décembre 2042","jeudi 31 décembre 2043","samedi 31 décembre 2044","dimanche 31 décembre 2045","lundi 31 décembre 2046"]
[null,"2025-01-14","s"]
[null,"2025-01-15","s"]
[null,"2025-01-16","s"]
[null,"2025-01-17","s",null,"LE CALENDRIER DOIT:"]
[null,"2025-01-18","fds",null,"- ÊTRE TRANSFÉRÉ SUR UNE SEULE PAGE ET DÉPOSÉ DANS LA SECTION PARTENAIRE DU SITE DU BC"]
[null,"2025-01-19","fds",null,"- ÊTRE INTÉGRÉ DANS LE DOCUMENT DE FORMATION À TITRE DE RÉFÉRENCE"]
[null,"2025-01-20","s"]
[null,"2025-01-21","s"]
[null,"2025-01-22","s",null,"LA LISTE DES JOURS FÉRIÉS: "]
[null,"2025-01-23","s",null,"- EST S'ÉTEND DE 2025 à 2037"]
[null,"2025-01-24","s",null,"- ELLE SERT DANS LE CALCUL DU TEMPS D'ATTENTE. NE PAS EFFACER."]
[null,"2025-01-25","fds"]
[null,"2025-01-26","fds"]
[null,"2025-01-27","s",null,"1er trsp","2e trsp","3e trsp","4e trsp"]
[null,"2025-01-28","s",null,{"$f":"IF(VLOOKUP(Général!$G14,$B$4:$D$1464,2,FALSE)=\"s\",\"jour de semaine\",\"jour de fin de semaine\")","v":{"$error":"#N/A"}},{"$f":"IF(VLOOKUP(#REF!,$B4:$D$1464,2,FALSE)=\"s\",\"Jour de semaine\",\"Jour de fin de semaine\")","v":{"$error":"#REF!"}},{"$f":"IF(VLOOKUP(#REF!,$B4:$D$1464,2,FALSE)=\"s\",\"Jour de semaine\",\"Jour de fin de semaine\")","v":{"$error":"#REF!"}},{"$f":"IF(VLOOKUP(#REF!,$B4:$D$1464,2,FALSE)=\"s\",\"Jour de semaine\",\"Jour de fin de semaine\")","v":{"$error":"#REF!"}}]
[null,"2025-01-29","s",null,{"$f":"IF(VLOOKUP(Général!$G14,$B$4:$D$1464,3,FALSE)=\"oui\",\"férié\",\"non férié\")","v":{"$error":"#N/A"}},{"$f":"IF(VLOOKUP(#REF!,$B4:$D$1464,3,FALSE)=\"oui\",\"férié\",\"non férié\")","v":{"$error":"#REF!"}},{"$f":"IF(VLOOKUP(#REF!,$B4:$D$1464,3,FALSE)=\"oui\",\"férié\",\"non férié\")","v":{"$error":"#REF!"}},{"$f":"IF(VLOOKUP(#REF!,$B4:$D$1464,3,FALSE)=\"oui\",\"férié\",\"non férié\")","v":{"$error":"#REF!"}}]
[null,"2025-01-30","s"]
[null,"2025-01-31","s",null,{"$f":"IF(VLOOKUP(Général!$L14,$B$4:$D$1464,2,FALSE)=\"s\",\"jour de semaine\",\"jour de fin de semaine\")","v":{"$error":"#N/A"}},{"$f":"IF(VLOOKUP(#REF!,$B4:$D$1464,2,FALSE)=\"s\",\"Jour de semaine\",\"Jour de fin de semaine\")","v":{"$error":"#REF!"}},{"$f":"IF(VLOOKUP(#REF!,$B4:$D$1464,2,FALSE)=\"s\",\"Jour de semaine\",\"Jour de fin de semaine\")","v":{"$error":"#REF!"}},{"$f":"IF(VLOOKUP(#REF!,$B4:$D$1464,2,FALSE)=\"s\",\"Jour de semaine\",\"Jour de fin de semaine\")","v":{"$error":"#REF!"}}]
[null,"2025-02-01","fds",null,{"$f":"IF(VLOOKUP(Général!$L14,$B$4:$D$1464,3,FALSE)=\"oui\",\"férié\",\"non férié\")","v":{"$error":"#N/A"}},{"$f":"IF(VLOOKUP(#REF!,$B4:$D$1464,3,FALSE)=\"oui\",\"férié\",\"non férié\")","v":{"$error":"#REF!"}},{"$f":"IF(VLOOKUP(#REF!,$B4:$D$1464,3,FALSE)=\"oui\",\"férié\",\"non férié\")","v":{"$error":"#REF!"}},{"$f":"IF(VLOOKUP(#REF!,$B4:$D$1464,3,FALSE)=\"oui\",\"férié\",\"non férié\")","v":{"$error":"#REF!"}}]
[null,"2025-02-02","fds"]
[null,"2025-02-03","s"]
[null,"2025-02-04","s"]
[null,"2025-02-05","s"]
[null,"2025-02-06","s"]
[null,"2025-02-07","s"]
[null,"2025-02-08","fds"]
[null,"2025-02-09","fds"]
[null,"2025-02-10","s"]
[null,"2025-02-11","s"]
[null,"2025-02-12","s",null,null,null,null,null,null,{"$f":"IF(J18<>J32,\"\",\"NON\")","v":"NON"}]
[null,"2025-02-13","s",null,null,null,null,null,null,"NON"]
[null,"2025-02-14","s",null,null,null,null,null,null,"NON"]
[null,"2025-02-15","fds"]
[null,"2025-02-16","fds"]
[null,"2025-02-17","s"]
[null,"2025-02-18","s"]
[null,"2025-02-19","s"]
[null,"2025-02-20","s"]
[null,"2025-02-21","s"]
[null,"2025-02-22","fds"]
[null,"2025-02-23","fds"]
[null,"2025-02-24","s"]
[null,"2025-02-25","s"]
[null,"2025-02-26","s"]
[null,"2025-02-27","s"]
[null,"2025-02-28","s"]
[null,"2025-03-01","fds"]
[null,"2025-03-02","fds"]
[null,"2025-03-03","s"]
[null,"2025-03-04","s"]
[null,"2025-03-05","s"]
[null,"2025-03-06","s"]
[null,"2025-03-07","s"]
[null,"2025-03-08","fds"]
[null,"2025-03-09","fds"]
[null,"2025-03-10","s"]
[null,"2025-03-11","s"]
[null,"2025-03-12","s"]
[null,"2025-03-13","s"]
[null,"2025-03-14","s"]
[null,"2025-03-15","fds"]
[null,"2025-03-16","fds"]
[null,"2025-03-17","s"]
[null,"2025-03-18","s"]
[null,"2025-03-19","s"]
[null,"2025-03-20","s"]
[null,"2025-03-21","s"]
[null,"2025-03-22","fds"]
[null,"2025-03-23","fds"]
[null,"2025-03-24","s"]
[null,"2025-03-25","s"]
[null,"2025-03-26","s"]
[null,"2025-03-27","s"]
[null,"2025-03-28","s"]
[null,"2025-03-29","fds"]
[null,"2025-03-30","fds"]
[null,"2025-03-31","s"]
[null,"2025-04-01","s"]
[null,"2025-04-02","s"]
[null,"2025-04-03","s"]
[null,"2025-04-04","s"]
[null,"2025-04-05","fds"]
[null,"2025-04-06","fds"]
[null,"2025-04-07","s"]
[null,"2025-04-08","s"]
[null,"2025-04-09","s"]
[null,"2025-04-10","s"]
[null,"2025-04-11","s"]
[null,"2025-04-12","fds"]
[null,"2025-04-13","fds"]
[null,"2025-04-14","s"]
[null,"2025-04-15","s"]
[null,"2025-04-16","s"]
[null,"2025-04-17","s"]
[null,"2025-04-18","s","oui"]
[null,"2025-04-19","fds"]
[null,"2025-04-20","fds"]
[null,"2025-04-21","s","oui"]
[null,"2025-04-22","s"]
[null,"2025-04-23","s"]
[null,"2025-04-24","s"]
[null,"2025-04-25","s"]
[null,"2025-04-26","fds"]
[null,"2025-04-27","fds"]
[null,"2025-04-28","s"]
[null,"2025-04-29","s"]
[null,"2025-04-30","s"]
[null,"2025-05-01","s"]
[null,"2025-05-02","s"]
[null,"2025-05-03","fds"]
[null,"2025-05-04","fds"]
[null,"2025-05-05","s"]
[null,"2025-05-06","s"]
[null,"2025-05-07","s"]
[null,"2025-05-08","s"]
[null,"2025-05-09","s"]
[null,"2025-05-10","fds"]
[null,"2025-05-11","fds"]
[null,"2025-05-12","s"]
[null,"2025-05-13","s"]
[null,"2025-05-14","s"]
[null,"2025-05-15","s"]
[null,"2025-05-16","s"]
[null,"2025-05-17","fds"]
[null,"2025-05-18","fds"]
[null,"2025-05-19","s","oui"]
[null,"2025-05-20","s"]
[null,"2025-05-21","s"]
[null,"2025-05-22","s"]
[null,"2025-05-23","s"]
[null,"2025-05-24","fds"]
[null,"2025-05-25","fds"]
[null,"2025-05-26","s"]
[null,"2025-05-27","s"]
[null,"2025-05-28","s"]
[null,"2025-05-29","s"]
[null,"2025-05-30","s"]
[null,"2025-05-31","fds"]
[null,"2025-06-01","fds"]
[null,"2025-06-02","s"]
[null,"2025-06-03","s"]
[null,"2025-06-04","s"]
[null,"2025-06-05","s"]
[null,"2025-06-06","s"]
[null,"2025-06-07","fds"]
[null,"2025-06-08","fds"]
[null,"2025-06-09","s"]
[null,"2025-06-10","s"]
[null,"2025-06-11","s"]
[null,"2025-06-12","s"]
[null,"2025-06-13","s"]
[null,"2025-06-14","fds"]
[null,"2025-06-15","fds"]
[null,"2025-06-16","s"]
[null,"2025-06-17","s"]
[null,"2025-06-18","s"]
[null,"2025-06-19","s"]
[null,"2025-06-20","s"]
[null,"2025-06-21","fds"]
[null,"2025-06-22","fds"]
[null,"2025-06-23","s"]
[null,"2025-06-24","s","oui"]
[null,"2025-06-25","s"]
[null,"2025-06-26","s"]
[null,"2025-06-27","s"]
[null,"2025-06-28","fds"]
[null,"2025-06-29","fds"]
[null,"2025-06-30","s"]
[null,"2025-07-01","s","oui"]
[null,"2025-07-02","s"]
[null,"2025-07-03","s"]
[null,"2025-07-04","s"]
[null,"2025-07-05","fds"]
[null,"2025-07-06","fds"]
[null,"2025-07-07","s"]
[null,"2025-07-08","s"]
[null,"2025-07-09","s"]
[null,"2025-07-10","s"]
[null,"2025-07-11","s"]
[null,"2025-07-12","fds"]
[null,"2025-07-13","fds"]
[null,"2025-07-14","s"]
[null,"2025-07-15","s"]
[null,"2025-07-16","s"]
[null,"2025-07-17","s"]
[null,"2025-07-18","s"]
[null,"2025-07-19","fds"]
[null,"2025-07-20","fds"]
[null,"2025-07-21","s"]
[null,"2025-07-22","s"]
[null,"2025-07-23","s"]
[null,"2025-07-24","s"]
[null,"2025-07-25","s"]
[null,"2025-07-26","fds"]
[null,"2025-07-27","fds"]
[null,"2025-07-28","s"]
[null,"2025-07-29","s"]
[null,"2025-07-30","s"]
[null,"2025-07-31","s"]
[null,"2025-08-01","s"]
[null,"2025-08-02","fds"]
[null,"2025-08-03","fds"]
[null,"2025-08-04","s"]
[null,"2025-08-05","s"]
[null,"2025-08-06","s"]
[null,"2025-08-07","s"]
[null,"2025-08-08","s"]
[null,"2025-08-09","fds"]
[null,"2025-08-10","fds"]
[null,"2025-08-11","s"]
[null,"2025-08-12","s"]
[null,"2025-08-13","s"]
[null,"2025-08-14","s"]
[null,"2025-08-15","s"]
[null,"2025-08-16","fds"]
[null,"2025-08-17","fds"]
[null,"2025-08-18","s"]
[null,"2025-08-19","s"]
[null,"2025-08-20","s"]
[null,"2025-08-21","s"]
[null,"2025-08-22","s"]
[null,"2025-08-23","fds"]
[null,"2025-08-24","fds"]
[null,"2025-08-25","s"]
[null,"2025-08-26","s"]
[null,"2025-08-27","s"]
[null,"2025-08-28","s"]
[null,"2025-08-29","s"]
[null,"2025-08-30","fds"]
[null,"2025-08-31","fds"]
[null,"2025-09-01","s","oui"]
[null,"2025-09-02","s"]
[null,"2025-09-03","s"]
[null,"2025-09-04","s"]
[null,"2025-09-05","s"]
[null,"2025-09-06","fds"]
[null,"2025-09-07","fds"]
[null,"2025-09-08","s"]
[null,"2025-09-09","s"]
[null,"2025-09-10","s"]
[null,"2025-09-11","s"]
[null,"2025-09-12","s"]
[null,"2025-09-13","fds"]
[null,"2025-09-14","fds"]
[null,"2025-09-15","s"]
[null,"2025-09-16","s"]
[null,"2025-09-17","s"]
[null,"2025-09-18","s"]
[null,"2025-09-19","s"]
[null,"2025-09-20","fds"]
[null,"2025-09-21","fds"]
[null,"2025-09-22","s"]
[null,"2025-09-23","s"]
[null,"2025-09-24","s"]
[null,"2025-09-25","s"]
[null,"2025-09-26","s"]
[null,"2025-09-27","fds"]
[null,"2025-09-28","fds"]
[null,"2025-09-29","s"]
[null,"2025-09-30","s"]
[null,"2025-10-01","s"]
[null,"2025-10-02","s"]
[null,"2025-10-03","s"]
[null,"2025-10-04","fds"]
[null,"2025-10-05","fds"]
[null,"2025-10-06","s"]
[null,"2025-10-07","s"]
[null,"2025-10-08","s"]
[null,"2025-10-09","s"]
[null,"2025-10-10","s"]
[null,"2025-10-11","fds"]
[null,"2025-10-12","fds"]
[null,"2025-10-13","s","oui"]
[null,"2025-10-14","s"]
[null,"2025-10-15","s"]
[null,"2025-10-16","s"]
[null,"2025-10-17","s"]
[null,"2025-10-18","fds"]
[null,"2025-10-19","fds"]
[null,"2025-10-20","s"]
[null,"2025-10-21","s"]
[null,"2025-10-22","s"]
[null,"2025-10-23","s"]
[null,"2025-10-24","s"]
[null,"2025-10-25","fds"]
[null,"2025-10-26","fds"]
[null,"2025-10-27","s"]
[null,"2025-10-28","s"]
[null,"2025-10-29","s"]
[null,"2025-10-30","s"]
[null,"2025-10-31","s"]
[null,"2025-11-01","fds"]
[null,"2025-11-02","fds"]
[null,"2025-11-03","s"]
[null,"2025-11-04","s"]
[null,"2025-11-05","s"]
[null,"2025-11-06","s"]
[null,"2025-11-07","s"]
[null,"2025-11-08","fds"]
[null,"2025-11-09","fds"]
[null,"2025-11-10","s"]
[null,"2025-11-11","s"]
[null,"2025-11-12","s"]
[null,"2025-11-13","s"]
[null,"2025-11-14","s"]
[null,"2025-11-15","fds"]
[null,"2025-11-16","fds"]
[null,"2025-11-17","s"]
[null,"2025-11-18","s"]
[null,"2025-11-19","s"]
[null,"2025-11-20","s"]
[null,"2025-11-21","s"]
[null,"2025-11-22","fds"]
[null,"2025-11-23","fds"]
[null,"2025-11-24","s"]
[null,"2025-11-25","s"]
[null,"2025-11-26","s"]
[null,"2025-11-27","s"]
[null,"2025-11-28","s"]
[null,"2025-11-29","fds"]
[null,"2025-11-30","fds"]
[null,"2025-12-01","s"]
[null,"2025-12-02","s"]
[null,"2025-12-03","s"]
[null,"2025-12-04","s"]
[null,"2025-12-05","s"]
[null,"2025-12-06","fds"]
[null,"2025-12-07","fds"]
[null,"2025-12-08","s"]
[null,"2025-12-09","s"]
[null,"2025-12-10","s"]
[null,"2025-12-11","s"]
[null,"2025-12-12","s"]
[null,"2025-12-13","fds"]
[null,"2025-12-14","fds"]
[null,"2025-12-15","s"]
[null,"2025-12-16","s"]
[null,"2025-12-17","s"]
[null,"2025-12-18","s"]
[null,"2025-12-19","s"]
[null,"2025-12-20","fds"]
[null,"2025-12-21","fds"]
[null,"2025-12-22","s"]
[null,"2025-12-23","s"]
[null,"2025-12-24","s","oui"]
[null,"2025-12-25","s","oui"]
[null,"2025-12-26","s","oui"]
[null,"2025-12-27","fds"]
[null,"2025-12-28","fds"]
[null,"2025-12-29","s"]
[null,"2025-12-30","s"]
[null,"2025-12-31","s","oui"]
[null,"2026-01-01","s","oui"]
[null,"2026-01-02","s","oui"]
[null,"2026-01-03","fds"]
[null,"2026-01-04","fds"]
[null,"2026-01-05","s"]
[null,"2026-01-06","s"]
[null,"2026-01-07","s"]
[null,"2026-01-08","s"]
[null,"2026-01-09","s"]
[null,"2026-01-10","fds"]
[null,"2026-01-11","fds"]
[null,"2026-01-12","s"]
[null,"2026-01-13","s"]
[null,"2026-01-14","s"]
[null,"2026-01-15","s"]
[null,"2026-01-16","s"]
[null,"2026-01-17","fds"]
[null,"2026-01-18","fds"]
[null,"2026-01-19","s"]
[null,"2026-01-20","s"]
[null,"2026-01-21","s"]
[null,"2026-01-22","s"]
[null,"2026-01-23","s"]
[null,"2026-01-24","fds"]
[null,"2026-01-25","fds"]
[null,"2026-01-26","s"]
[null,"2026-01-27","s"]
[null,"2026-01-28","s"]
[null,"2026-01-29","s"]
[null,"2026-01-30","s"]
[null,"2026-01-31","fds"]
[null,"2026-02-01","fds"]
[null,"2026-02-02","s"]
[null,"2026-02-03","s"]
[null,"2026-02-04","s"]
[null,"2026-02-05","s"]
[null,"2026-02-06","s"]
[null,"2026-02-07","fds"]
[null,"2026-02-08","fds"]
[null,"2026-02-09","s"]
[null,"2026-02-10","s"]
[null,"2026-02-11","s"]
[null,"2026-02-12","s"]
[null,"2026-02-13","s"]
[null,"2026-02-14","fds"]
[null,"2026-02-15","fds"]
[null,"2026-02-16","s"]
[null,"2026-02-17","s"]
[null,"2026-02-18","s"]
[null,"2026-02-19","s"]
[null,"2026-02-20","s"]
[null,"2026-02-21","fds"]
[null,"2026-02-22","fds"]
[null,"2026-02-23","s"]
[null,"2026-02-24","s"]
[null,"2026-02-25","s"]
[null,"2026-02-26","s"]
[null,"2026-02-27","s"]
[null,"2026-02-28","fds"]
[null,"2026-03-01","fds"]
[null,"2026-03-02","s"]
[null,"2026-03-03","s"]
[null,"2026-03-04","s"]
[null,"2026-03-05","s"]
[null,"2026-03-06","s"]
[null,"2026-03-07","fds"]
[null,"2026-03-08","fds"]
[null,"2026-03-09","s"]
[null,"2026-03-10","s"]
[null,"2026-03-11","s"]
[null,"2026-03-12","s"]
[null,"2026-03-13","s"]
[null,"2026-03-14","fds"]
[null,"2026-03-15","fds"]
[null,"2026-03-16","s"]
[null,"2026-03-17","s"]
[null,"2026-03-18","s"]
[null,"2026-03-19","s"]
[null,"2026-03-20","s"]
[null,"2026-03-21","fds"]
[null,"2026-03-22","fds"]
[null,"2026-03-23","s"]
[null,"2026-03-24","s"]
[null,"2026-03-25","s"]
[null,"2026-03-26","s"]
[null,"2026-03-27","s"]
[null,"2026-03-28","fds"]
[null,"2026-03-29","fds"]
[null,"2026-03-30","s"]
[null,"2026-03-31","s"]
[null,"2026-04-01","s"]
[null,"2026-04-02","s"]
[null,"2026-04-03","s","oui"]
[null,"2026-04-04","fds"]
[null,"2026-04-05","fds"]
[null,"2026-04-06","s","oui"]
[null,"2026-04-07","s"]
[null,"2026-04-08","s"]
[null,"2026-04-09","s"]
[null,"2026-04-10","s"]
[null,"2026-04-11","fds"]
[null,"2026-04-12","fds"]
[null,"2026-04-13","s"]
[null,"2026-04-14","s"]
[null,"2026-04-15","s"]
[null,"2026-04-16","s"]
[null,"2026-04-17","s"]
[null,"2026-04-18","fds"]
[null,"2026-04-19","fds"]
[null,"2026-04-20","s"]
[null,"2026-04-21","s"]
[null,"2026-04-22","s"]
[null,"2026-04-23","s"]
[null,"2026-04-24","s"]
[null,"2026-04-25","fds"]
[null,"2026-04-26","fds"]
[null,"2026-04-27","s"]
[null,"2026-04-28","s"]
[null,"2026-04-29","s"]
[null,"2026-04-30","s"]
[null,"2026-05-01","s"]
[null,"2026-05-02","fds"]
[null,"2026-05-03","fds"]
[null,"2026-05-04","s"]
[null,"2026-05-05","s"]
[null,"2026-05-06","s"]
[null,"2026-05-07","s"]
[null,"2026-05-08","s"]
[null,"2026-05-09","fds"]
[null,"2026-05-10","fds"]
[null,"2026-05-11","s"]
[null,"2026-05-12","s"]
[null,"2026-05-13","s"]
[null,"2026-05-14","s"]
[null,"2026-05-15","s"]
[null,"2026-05-16","fds"]
[null,"2026-05-17","fds"]
[null,"2026-05-18","s","oui"]
[null,"2026-05-19","s"]
[null,"2026-05-20","s"]
[null,"2026-05-21","s"]
[null,"2026-05-22","s"]
[null,"2026-05-23","fds"]
[null,"2026-05-24","fds"]
[null,"2026-05-25","s"]
[null,"2026-05-26","s"]
[null,"2026-05-27","s"]
[null,"2026-05-28","s"]
[null,"2026-05-29","s"]
[null,"2026-05-30","fds"]
[null,"2026-05-31","fds"]
[null,"2026-06-01","s"]
[null,"2026-06-02","s"]
[null,"2026-06-03","s"]
[null,"2026-06-04","s"]
[null,"2026-06-05","s"]
[null,"2026-06-06","fds"]
[null,"2026-06-07","fds"]
[null,"2026-06-08","s"]
[null,"2026-06-09","s"]
[null,"2026-06-10","s"]
[null,"2026-06-11","s"]
[null,"2026-06-12","s"]
[null,"2026-06-13","fds"]
[null,"2026-06-14","fds"]
[null,"2026-06-15","s"]
[null,"2026-06-16","s"]
[null,"2026-06-17","s"]
[null,"2026-06-18","s"]
[null,"2026-06-19","s"]
[null,"2026-06-20","fds"]
[null,"2026-06-21","fds"]
[null,"2026-06-22","s"]
[null,"2026-06-23","s"]
[null,"2026-06-24","s","oui"]
[null,"2026-06-25","s"]
[null,"2026-06-26","s"]
[null,"2026-06-27","fds"]
[null,"2026-06-28","fds"]
[null,"2026-06-29","s"]
[null,"2026-06-30","s"]
[null,"2026-07-01","s","oui"]
[null,"2026-07-02","s"]
[null,"2026-07-03","s"]
[null,"2026-07-04","fds"]
[null,"2026-07-05","fds"]
[null,"2026-07-06","s"]
[null,"2026-07-07","s"]
[null,"2026-07-08","s"]
[null,"2026-07-09","s"]
[null,"2026-07-10","s"]
[null,"2026-07-11","fds"]
[null,"2026-07-12","fds"]
[null,"2026-07-13","s"]
[null,"2026-07-14","s"]
[null,"2026-07-15","s"]
[null,"2026-07-16","s"]
[null,"2026-07-17","s"]
[null,"2026-07-18","fds"]
[null,"2026-07-19","fds"]
[null,"2026-07-20","s"]
[null,"2026-07-21","s"]
[null,"2026-07-22","s"]
[null,"2026-07-23","s"]
[null,"2026-07-24","s"]
[null,"2026-07-25","fds"]
[null,"2026-07-26","fds"]
[null,"2026-07-27","s"]
[null,"2026-07-28","s"]
[null,"2026-07-29","s"]
[null,"2026-07-30","s"]
[null,"2026-07-31","s"]
[null,"2026-08-01","fds"]
[null,"2026-08-02","fds"]
[null,"2026-08-03","s"]
[null,"2026-08-04","s"]
[null,"2026-08-05","s"]
[null,"2026-08-06","s"]
[null,"2026-08-07","s"]
[null,"2026-08-08","fds"]
[null,"2026-08-09","fds"]
[null,"2026-08-10","s"]
[null,"2026-08-11","s"]
[null,"2026-08-12","s"]
[null,"2026-08-13","s"]
[null,"2026-08-14","s"]
[null,"2026-08-15","fds"]
[null,"2026-08-16","fds"]
[null,"2026-08-17","s"]
[null,"2026-08-18","s"]
[null,"2026-08-19","s"]
[null,"2026-08-20","s"]
[null,"2026-08-21","s"]
[null,"2026-08-22","fds"]
[null,"2026-08-23","fds"]
[null,"2026-08-24","s"]
[null,"2026-08-25","s"]
[null,"2026-08-26","s"]
[null,"2026-08-27","s"]
[null,"2026-08-28","s"]
[null,"2026-08-29","fds"]
[null,"2026-08-30","fds"]
[null,"2026-08-31","s"]
[null,"2026-09-01","s"]
[null,"2026-09-02","s"]
[null,"2026-09-03","s"]
[null,"2026-09-04","s"]
[null,"2026-09-05","fds"]
[null,"2026-09-06","fds"]
[null,"2026-09-07","s","oui"]
[null,"2026-09-08","s"]
[null,"2026-09-09","s"]
[null,"2026-09-10","s"]
[null,"2026-09-11","s"]
[null,"2026-09-12","fds"]
[null,"2026-09-13","fds"]
[null,"2026-09-14","s"]
[null,"2026-09-15","s"]
[null,"2026-09-16","s"]
[null,"2026-09-17","s"]
[null,"2026-09-18","s"]
[null,"2026-09-19","fds"]
[null,"2026-09-20","fds"]
[null,"2026-09-21","s"]
[null,"2026-09-22","s"]
[null,"2026-09-23","s"]
[null,"2026-09-24","s"]
[null,"2026-09-25","s"]
[null,"2026-09-26","fds"]
[null,"2026-09-27","fds"]
[null,"2026-09-28","s"]
[null,"2026-09-29","s"]
[null,"2026-09-30","s"]
[null,"2026-10-01","s"]
[null,"2026-10-02","s"]
[null,"2026-10-03","fds"]
[null,"2026-10-04","fds"]
[null,"2026-10-05","s"]
[null,"2026-10-06","s"]
[null,"2026-10-07","s"]
[null,"2026-10-08","s"]
[null,"2026-10-09","s"]
[null,"2026-10-10","fds"]
[null,"2026-10-11","fds"]
[null,"2026-10-12","s","oui"]
[null,"2026-10-13","s"]
[null,"2026-10-14","s"]
[null,"2026-10-15","s"]
[null,"2026-10-16","s"]
[null,"2026-10-17","fds"]
[null,"2026-10-18","fds"]
[null,"2026-10-19","s"]
[null,"2026-10-20","s"]
[null,"2026-10-21","s"]
[null,"2026-10-22","s"]
[null,"2026-10-23","s"]
[null,"2026-10-24","fds"]
[null,"2026-10-25","fds"]
[null,"2026-10-26","s"]
[null,"2026-10-27","s"]
[null,"2026-10-28","s"]
[null,"2026-10-29","s"]
[null,"2026-10-30","s"]
[null,"2026-10-31","fds"]
[null,"2026-11-01","fds"]
[null,"2026-11-02","s"]
[null,"2026-11-03","s"]
[null,"2026-11-04","s"]
[null,"2026-11-05","s"]
[null,"2026-11-06","s"]
[null,"2026-11-07","fds"]
[null,"2026-11-08","fds"]
[null,"2026-11-09","s"]
[null,"2026-11-10","s"]
[null,"2026-11-11","s"]
[null,"2026-11-12","s"]
[null,"2026-11-13","s"]
[null,"2026-11-14","fds"]
[null,"2026-11-15","fds"]
[null,"2026-11-16","s"]
[null,"2026-11-17","s"]
[null,"2026-11-18","s"]
[null,"2026-11-19","s"]
[null,"2026-11-20","s"]
[null,"2026-11-21","fds"]
[null,"2026-11-22","fds"]
[null,"2026-11-23","s"]
[null,"2026-11-24","s"]
[null,"2026-11-25","s"]
[null,"2026-11-26","s"]
[null,"2026-11-27","s"]
[null,"2026-11-28","fds"]
[null,"2026-11-29","fds"]
[null,"2026-11-30","s"]
[null,"2026-12-01","s"]
[null,"2026-12-02","s"]
[null,"2026-12-03","s"]
[null,"2026-12-04","s"]
[null,"2026-12-05","fds"]
[null,"2026-12-06","fds"]
[null,"2026-12-07","s"]
[null,"2026-12-08","s"]
[null,"2026-12-09","s"]
[null,"2026-12-10","s"]
[null,"2026-12-11","s"]
[null,"2026-12-12","fds"]
[null,"2026-12-13","fds"]
[null,"2026-12-14","s"]
[null,"2026-12-15","s"]
[null,"2026-12-16","s"]
[null,"2026-12-17","s"]
[null,"2026-12-18","s"]
[null,"2026-12-19","fds"]
[null,"2026-12-20","fds"]
[null,"2026-12-21","s"]
[null,"2026-12-22","s"]
[null,"2026-12-23","s"]
[null,"2026-12-24","s","oui"]
[null,"2026-12-25","s","oui"]
[null,"2026-12-26","fds","oui"]
[null,"2026-12-27","fds"]
[null,"2026-12-28","s"]
[null,"2026-12-29","s"]
[null,"2026-12-30","s"]
[null,"2026-12-31","s","oui"]
[null,"2027-01-01","s","oui"]
[null,"2027-01-02","fds","oui"]
[null,"2027-01-03","fds"]
[null,"2027-01-04","s"]
[null,"2027-01-05","s"]
[null,"2027-01-06","s"]
[null,"2027-01-07","s"]
[null,"2027-01-08","s"]
[null,"2027-01-09","fds"]
[null,"2027-01-10","fds"]
[null,"2027-01-11","s"]
[null,"2027-01-12","s"]
[null,"2027-01-13","s"]
[null,"2027-01-14","s"]
[null,"2027-01-15","s"]
[null,"2027-01-16","fds"]
[null,"2027-01-17","fds"]
[null,"2027-01-18","s"]
[null,"2027-01-19","s"]
[null,"2027-01-20","s"]
[null,"2027-01-21","s"]
[null,"2027-01-22","s"]
[null,"2027-01-23","fds"]
[null,"2027-01-24","fds"]
[null,"2027-01-25","s"]
[null,"2027-01-26","s"]
[null,"2027-01-27","s"]
[null,"2027-01-28","s"]
[null,"2027-01-29","s"]
[null,"2027-01-30","fds"]
[null,"2027-01-31","fds"]
[null,"2027-02-01","s"]
[null,"2027-02-02","s"]
[null,"2027-02-03","s"]
[null,"2027-02-04","s"]
[null,"2027-02-05","s"]
[null,"2027-02-06","fds"]
[null,"2027-02-07","fds"]
[null,"2027-02-08","s"]
[null,"2027-02-09","s"]
[null,"2027-02-10","s"]
[null,"2027-02-11","s"]
[null,"2027-02-12","s"]
[null,"2027-02-13","fds"]
[null,"2027-02-14","fds"]
[null,"2027-02-15","s"]
[null,"2027-02-16","s"]
[null,"2027-02-17","s"]
[null,"2027-02-18","s"]
[null,"2027-02-19","s"]
[null,"2027-02-20","fds"]
[null,"2027-02-21","fds"]
[null,"2027-02-22","s"]
[null,"2027-02-23","s"]
[null,"2027-02-24","s"]
[null,"2027-02-25","s"]
[null,"2027-02-26","s"]
[null,"2027-02-27","fds"]
[null,"2027-02-28","fds"]
[null,"2027-03-01","s"]
[null,"2027-03-02","s"]
[null,"2027-03-03","s"]
[null,"2027-03-04","s"]
[null,"2027-03-05","s"]
[null,"2027-03-06","fds"]
[null,"2027-03-07","fds"]
[null,"2027-03-08","s"]
[null,"2027-03-09","s"]
[null,"2027-03-10","s"]
[null,"2027-03-11","s"]
[null,"2027-03-12","s"]
[null,"2027-03-13","fds"]
[null,"2027-03-14","fds"]
[null,"2027-03-15","s"]
[null,"2027-03-16","s"]
[null,"2027-03-17","s"]
[null,"2027-03-18","s"]
[null,"2027-03-19","s"]
[null,"2027-03-20","fds"]
[null,"2027-03-21","fds"]
[null,"2027-03-22","s"]
[null,"2027-03-23","s"]
[null,"2027-03-24","s"]
[null,"2027-03-25","s"]
[null,"2027-03-26","s","oui"]
[null,"2027-03-27","fds"]
[null,"2027-03-28","fds"]
[null,"2027-03-29","s","oui"]
[null,"2027-03-30","s"]
[null,"2027-03-31","s"]
[null,"2027-04-01","s"]
[null,"2027-04-02","s"]
[null,"2027-04-03","fds"]
[null,"2027-04-04","fds"]
[null,"2027-04-05","s"]
[null,"2027-04-06","s"]
[null,"2027-04-07","s"]
[null,"2027-04-08","s"]
[null,"2027-04-09","s"]
[null,"2027-04-10","fds"]
[null,"2027-04-11","fds"]
[null,"2027-04-12","s"]
[null,"2027-04-13","s"]
[null,"2027-04-14","s"]
[null,"2027-04-15","s"]
[null,"2027-04-16","s"]
[null,"2027-04-17","fds"]
[null,"2027-04-18","fds"]
[null,"2027-04-19","s"]
[null,"2027-04-20","s"]
[null,"2027-04-21","s"]
[null,"2027-04-22","s"]
[null,"2027-04-23","s"]
[null,"2027-04-24","fds"]
[null,"2027-04-25","fds"]
[null,"2027-04-26","s"]
[null,"2027-04-27","s"]
[null,"2027-04-28","s"]
[null,"2027-04-29","s"]
[null,"2027-04-30","s"]
[null,"2027-05-01","fds"]
[null,"2027-05-02","fds"]
[null,"2027-05-03","s"]
[null,"2027-05-04","s"]
[null,"2027-05-05","s"]
[null,"2027-05-06","s"]
[null,"2027-05-07","s"]
[null,"2027-05-08","fds"]
[null,"2027-05-09","fds"]
[null,"2027-05-10","s"]
[null,"2027-05-11","s"]
[null,"2027-05-12","s"]
[null,"2027-05-13","s"]
[null,"2027-05-14","s"]
[null,"2027-05-15","fds"]
[null,"2027-05-16","fds"]
[null,"2027-05-17","s"]
[null,"2027-05-18","s"]
[null,"2027-05-19","s"]
[null,"2027-05-20","s"]
[null,"2027-05-21","s"]
[null,"2027-05-22","fds"]
[null,"2027-05-23","fds"]
[null,"2027-05-24","s","oui"]
[null,"2027-05-25","s"]
[null,"2027-05-26","s"]
[null,"2027-05-27","s"]
[null,"2027-05-28","s"]
[null,"2027-05-29","fds"]
[null,"2027-05-30","fds"]
[null,"2027-05-31","s"]
[null,"2027-06-01","s"]
[null,"2027-06-02","s"]
[null,"2027-06-03","s"]
[null,"2027-06-04","s"]
[null,"2027-06-05","fds"]
[null,"2027-06-06","fds"]
[null,"2027-06-07","s"]
[null,"2027-06-08","s"]
[null,"2027-06-09","s"]
[null,"2027-06-10","s"]
[null,"2027-06-11","s"]
[null,"2027-06-12","fds"]
[null,"2027-06-13","fds"]
[null,"2027-06-14","s"]
[null,"2027-06-15","s"]
[null,"2027-06-16","s"]
[null,"2027-06-17","s"]
[null,"2027-06-18","s"]
[null,"2027-06-19","fds"]
[null,"2027-06-20","fds"]
[null,"2027-06-21","s"]
[null,"2027-06-22","s"]
[null,"2027-06-23","s"]
[null,"2027-06-24","s","oui"]
[null,"2027-06-25","s"]
[null,"2027-06-26","fds"]
[null,"2027-06-27","fds"]
[null,"2027-06-28","s"]
[null,"2027-06-29","s"]
[null,"2027-06-30","s"]
[null,"2027-07-01","s","oui"]
[null,"2027-07-02","s"]
[null,"2027-07-03","fds"]
[null,"2027-07-04","fds"]
[null,"2027-07-05","s"]
[null,"2027-07-06","s"]
[null,"2027-07-07","s"]
[null,"2027-07-08","s"]
[null,"2027-07-09","s"]
[null,"2027-07-10","fds"]
[null,"2027-07-11","fds"]
[null,"2027-07-12","s"]
[null,"2027-07-13","s"]
[null,"2027-07-14","s"]
[null,"2027-07-15","s"]
[null,"2027-07-16","s"]
[null,"2027-07-17","fds"]
[null,"2027-07-18","fds"]
[null,"2027-07-19","s"]
[null,"2027-07-20","s"]
[null,"2027-07-21","s"]
[null,"2027-07-22","s"]
[null,"2027-07-23","s"]
[null,"2027-07-24","fds"]
[null,"2027-07-25","fds"]
[null,"2027-07-26","s"]
[null,"2027-07-27","s"]
[null,"2027-07-28","s"]
[null,"2027-07-29","s"]
[null,"2027-07-30","s"]
[null,"2027-07-31","fds"]
[null,"2027-08-01","fds"]
[null,"2027-08-02","s"]
[null,"2027-08-03","s"]
[null,"2027-08-04","s"]
[null,"2027-08-05","s"]
[null,"2027-08-06","s"]
[null,"2027-08-07","fds"]
[null,"2027-08-08","fds"]
[null,"2027-08-09","s"]
[null,"2027-08-10","s"]
[null,"2027-08-11","s"]
[null,"2027-08-12","s"]
[null,"2027-08-13","s"]
[null,"2027-08-14","fds"]
[null,"2027-08-15","fds"]
[null,"2027-08-16","s"]
[null,"2027-08-17","s"]
[null,"2027-08-18","s"]
[null,"2027-08-19","s"]
[null,"2027-08-20","s"]
[null,"2027-08-21","fds"]
[null,"2027-08-22","fds"]
[null,"2027-08-23","s"]
[null,"2027-08-24","s"]
[null,"2027-08-25","s"]
[null,"2027-08-26","s"]
[null,"2027-08-27","s"]
[null,"2027-08-28","fds"]
[null,"2027-08-29","fds"]
[null,"2027-08-30","s"]
[null,"2027-08-31","s"]
[null,"2027-09-01","s"]
[null,"2027-09-02","s"]
[null,"2027-09-03","s"]
[null,"2027-09-04","fds"]
[null,"2027-09-05","fds"]
[null,"2027-09-06","s","oui"]
[null,"2027-09-07","s"]
[null,"2027-09-08","s"]
[null,"2027-09-09","s"]
[null,"2027-09-10","s"]
[null,"2027-09-11","fds"]
[null,"2027-09-12","fds"]
[null,"2027-09-13","s"]
[null,"2027-09-14","s"]
[null,"2027-09-15","s"]
[null,"2027-09-16","s"]
[null,"2027-09-17","s"]
[null,"2027-09-18","fds"]
[null,"2027-09-19","fds"]
[null,"2027-09-20","s"]
[null,"2027-09-21","s"]
[null,"2027-09-22","s"]
[null,"2027-09-23","s"]
[null,"2027-09-24","s"]
[null,"2027-09-25","fds"]
[null,"2027-09-26","fds"]
[null,"2027-09-27","s"]
[null,"2027-09-28","s"]
[null,"2027-09-29","s"]
[null,"2027-09-30","s"]
[null,"2027-10-01","s"]
[null,"2027-10-02","fds"]
[null,"2027-10-03","fds"]
[null,"2027-10-04","s"]
[null,"2027-10-05","s"]
[null,"2027-10-06","s"]
[null,"2027-10-07","s"]
[null,"2027-10-08","s"]
[null,"2027-10-09","fds"]
[null,"2027-10-10","fds"]
[null,"2027-10-11","s","oui"]
[null,"2027-10-12","s"]
[null,"2027-10-13","s"]
[null,"2027-10-14","s"]
[null,"2027-10-15","s"]
[null,"2027-10-16","fds"]
[null,"2027-10-17","fds"]
[null,"2027-10-18","s"]
[null,"2027-10-19","s"]
[null,"2027-10-20","s"]
[null,"2027-10-21","s"]
[null,"2027-10-22","s"]
[null,"2027-10-23","fds"]
[null,"2027-10-24","fds"]
[null,"2027-10-25","s"]
[null,"2027-10-26","s"]
[null,"2027-10-27","s"]
[null,"2027-10-28","s"]
[null,"2027-10-29","s"]
[null,"2027-10-30","fds"]
[null,"2027-10-31","fds"]
[null,"2027-11-01","s"]
[null,"2027-11-02","s"]
[null,"2027-11-03","s"]
[null,"2027-11-04","s"]
[null,"2027-11-05","s"]
[null,"2027-11-06","fds"]
[null,"2027-11-07","fds"]
[null,"2027-11-08","s"]
[null,"2027-11-09","s"]
[null,"2027-11-10","s"]
[null,"2027-11-11","s"]
[null,"2027-11-12","s"]
[null,"2027-11-13","fds"]
[null,"2027-11-14","fds"]
[null,"2027-11-15","s"]
[null,"2027-11-16","s"]
[null,"2027-11-17","s"]
[null,"2027-11-18","s"]
[null,"2027-11-19","s"]
[null,"2027-11-20","fds"]
[null,"2027-11-21","fds"]
[null,"2027-11-22","s"]
[null,"2027-11-23","s"]
[null,"2027-11-24","s"]
[null,"2027-11-25","s"]
[null,"2027-11-26","s"]
[null,"2027-11-27","fds"]
[null,"2027-11-28","fds"]
[null,"2027-11-29","s"]
[null,"2027-11-30","s"]
[null,"2027-12-01","s"]
[null,"2027-12-02","s"]
[null,"2027-12-03","s"]
[null,"2027-12-04","fds"]
[null,"2027-12-05","fds"]
[null,"2027-12-06","s"]
[null,"2027-12-07","s"]
[null,"2027-12-08","s"]
[null,"2027-12-09","s"]
[null,"2027-12-10","s"]
[null,"2027-12-11","fds"]
[null,"2027-12-12","fds"]
[null,"2027-12-13","s"]
[null,"2027-12-14","s"]
[null,"2027-12-15","s"]
[null,"2027-12-16","s"]
[null,"2027-12-17","s"]
[null,"2027-12-18","fds"]
[null,"2027-12-19","fds"]
[null,"2027-12-20","s"]
[null,"2027-12-21","s"]
[null,"2027-12-22","s"]
[null,"2027-12-23","s"]
[null,"2027-12-24","s","oui"]
[null,"2027-12-25","fds","oui"]
[null,"2027-12-26","fds","oui"]
[null,"2027-12-27","s"]
[null,"2027-12-28","s"]
[null,"2027-12-29","s"]
[null,"2027-12-30","s"]
[null,"2027-12-31","s","oui"]
[null,"2028-01-01","fds","oui"]
[null,"2028-01-02","fds","oui"]
[null,"2028-01-03","s"]
[null,"2028-01-04","s"]
[null,"2028-01-05","s"]
[null,"2028-01-06","s"]
[null,"2028-01-07","s"]
[null,"2028-01-08","fds"]
[null,"2028-01-09","fds"]
[null,"2028-01-10","s"]
[null,"2028-01-11","s"]
[null,"2028-01-12","s"]
[null,"2028-01-13","s"]
[null,"2028-01-14","s"]
[null,"2028-01-15","fds"]
[null,"2028-01-16","fds"]
[null,"2028-01-17","s"]
[null,"2028-01-18","s"]
[null,"2028-01-19","s"]
[null,"2028-01-20","s"]
[null,"2028-01-21","s"]
[null,"2028-01-22","fds"]
[null,"2028-01-23","fds"]
[null,"2028-01-24","s"]
[null,"2028-01-25","s"]
[null,"2028-01-26","s"]
[null,"2028-01-27","s"]
[null,"2028-01-28","s"]
[null,"2028-01-29","fds"]
[null,"2028-01-30","fds"]
[null,"2028-01-31","s"]
[null,"2028-02-01","s"]
[null,"2028-02-02","s"]
[null,"2028-02-03","s"]
[null,"2028-02-04","s"]
[null,"2028-02-05","fds"]
[null,"2028-02-06","fds"]
[null,"2028-02-07","s"]
[null,"2028-02-08","s"]
[null,"2028-02-09","s"]
[null,"2028-02-10","s"]
[null,"2028-02-11","s"]
[null,"2028-02-12","fds"]
[null,"2028-02-13","fds"]
[null,"2028-02-14","s"]
[null,"2028-02-15","s"]
[null,"2028-02-16","s"]
[null,"2028-02-17","s"]
[null,"2028-02-18","s"]
[null,"2028-02-19","fds"]
[null,"2028-02-20","fds"]
[null,"2028-02-21","s"]
[null,"2028-02-22","s"]
[null,"2028-02-23","s"]
[null,"2028-02-24","s"]
[null,"2028-02-25","s"]
[null,"2028-02-26","fds"]
[null,"2028-02-27","fds"]
[null,"2028-02-28","s"]
[null,"2028-02-29","s"]
[null,"2028-03-01","s"]
[null,"2028-03-02","s"]
[null,"2028-03-03","s"]
[null,"2028-03-04","fds"]
[null,"2028-03-05","fds"]
[null,"2028-03-06","s"]
[null,"2028-03-07","s"]
[null,"2028-03-08","s"]
[null,"2028-03-09","s"]
[null,"2028-03-10","s"]
[null,"2028-03-11","fds"]
[null,"2028-03-12","fds"]
[null,"2028-03-13","s"]
[null,"2028-03-14","s"]
[null,"2028-03-15","s"]
[null,"2028-03-16","s"]
[null,"2028-03-17","s"]
[null,"2028-03-18","fds"]
[null,"2028-03-19","fds"]
[null,"2028-03-20","s"]
[null,"2028-03-21","s"]
[null,"2028-03-22","s"]
[null,"2028-03-23","s"]
[null,"2028-03-24","s"]
[null,"2028-03-25","fds"]
[null,"2028-03-26","fds"]
[null,"2028-03-27","s"]
[null,"2028-03-28","s"]
[null,"2028-03-29","s"]
[null,"2028-03-30","s"]
[null,"2028-03-31","s"]
[null,"2028-04-01","fds"]
[null,"2028-04-02","fds"]
[null,"2028-04-03","s"]
[null,"2028-04-04","s"]
[null,"2028-04-05","s"]
[null,"2028-04-06","s"]
[null,"2028-04-07","s"]
[null,"2028-04-08","fds"]
[null,"2028-04-09","fds"]
[null,"2028-04-10","s"]
[null,"2028-04-11","s"]
[null,"2028-04-12","s"]
[null,"2028-04-13","s"]
[null,"2028-04-14","s","oui"]
[null,"2028-04-15","fds"]
[null,"2028-04-16","fds"]
[null,"2028-04-17","s","oui"]
[null,"2028-04-18","s"]
[null,"2028-04-19","s"]
[null,"2028-04-20","s"]
[null,"2028-04-21","s"]
[null,"2028-04-22","fds"]
[null,"2028-04-23","fds"]
[null,"2028-04-24","s"]
[null,"2028-04-25","s"]
[null,"2028-04-26","s"]
[null,"2028-04-27","s"]
[null,"2028-04-28","s"]
[null,"2028-04-29","fds"]
[null,"2028-04-30","fds"]
[null,"2028-05-01","s"]
[null,"2028-05-02","s"]
[null,"2028-05-03","s"]
[null,"2028-05-04","s"]
[null,"2028-05-05","s"]
[null,"2028-05-06","fds"]
[null,"2028-05-07","fds"]
[null,"2028-05-08","s"]
[null,"2028-05-09","s"]
[null,"2028-05-10","s"]
[null,"2028-05-11","s"]
[null,"2028-05-12","s"]
[null,"2028-05-13","fds"]
[null,"2028-05-14","fds"]
[null,"2028-05-15","s"]
[null,"2028-05-16","s"]
[null,"2028-05-17","s"]
[null,"2028-05-18","s"]
[null,"2028-05-19","s"]
[null,"2028-05-20","fds"]
[null,"2028-05-21","fds"]
[null,"2028-05-22","s","oui"]
[null,"2028-05-23","s"]
[null,"2028-05-24","s"]
[null,"2028-05-25","s"]
[null,"2028-05-26","s"]
[null,"2028-05-27","fds"]
[null,"2028-05-28","fds"]
[null,"2028-05-29","s"]
[null,"2028-05-30","s"]
[null,"2028-05-31","s"]
[null,"2028-06-01","s"]
[null,"2028-06-02","s"]
[null,"2028-06-03","fds"]
[null,"2028-06-04","fds"]
[null,"2028-06-05","s"]
[null,"2028-06-06","s"]
[null,"2028-06-07","s"]
[null,"2028-06-08","s"]
[null,"2028-06-09","s"]
[null,"2028-06-10","fds"]
[null,"2028-06-11","fds"]
[null,"2028-06-12","s"]
[null,"2028-06-13","s"]
[null,"2028-06-14","s"]
[null,"2028-06-15","s"]
[null,"2028-06-16","s"]
[null,"2028-06-17","fds"]
[null,"2028-06-18","fds"]
[null,"2028-06-19","s"]
[null,"2028-06-20","s"]
[null,"2028-06-21","s"]
[null,"2028-06-22","s"]
[null,"2028-06-23","s"]
[null,"2028-06-24","fds","oui"]
[null,"2028-06-25","fds"]
[null,"2028-06-26","s"]
[null,"2028-06-27","s"]
[null,"2028-06-28","s"]
[null,"2028-06-29","s"]
[null,"2028-06-30","s"]
[null,"2028-07-01","fds","oui"]
[null,"2028-07-02","fds"]
[null,"2028-07-03","s"]
[null,"2028-07-04","s"]
[null,"2028-07-05","s"]
[null,"2028-07-06","s"]
[null,"2028-07-07","s"]
[null,"2028-07-08","fds"]
[null,"2028-07-09","fds"]
[null,"2028-07-10","s"]
[null,"2028-07-11","s"]
[null,"2028-07-12","s"]
[null,"2028-07-13","s"]
[null,"2028-07-14","s"]
[null,"2028-07-15","fds"]
[null,"2028-07-16","fds"]
[null,"2028-07-17","s"]
[null,"2028-07-18","s"]
[null,"2028-07-19","s"]
[null,"2028-07-20","s"]
[null,"2028-07-21","s"]
[null,"2028-07-22","fds"]
[null,"2028-07-23","fds"]
[null,"2028-07-24","s"]
[null,"2028-07-25","s"]
[null,"2028-07-26","s"]
[null,"2028-07-27","s"]
[null,"2028-07-28","s"]
[null,"2028-07-29","fds"]
[null,"2028-07-30","fds"]
[null,"2028-07-31","s"]
[null,"2028-08-01","s"]
[null,"2028-08-02","s"]
[null,"2028-08-03","s"]
[null,"2028-08-04","s"]
[null,"2028-08-05","fds"]
[null,"2028-08-06","fds"]
[null,"2028-08-07","s"]
[null,"2028-08-08","s"]
[null,"2028-08-09","s"]
[null,"2028-08-10","s"]
[null,"2028-08-11","s"]
[null,"2028-08-12","fds"]
[null,"2028-08-13","fds"]
[null,"2028-08-14","s"]
[null,"2028-08-15","s"]
[null,"2028-08-16","s"]
[null,"2028-08-17","s"]
[null,"2028-08-18","s"]
[null,"2028-08-19","fds"]
[null,"2028-08-20","fds"]
[null,"2028-08-21","s"]
[null,"2028-08-22","s"]
[null,"2028-08-23","s"]
[null,"2028-08-24","s"]
[null,"2028-08-25","s"]
[null,"2028-08-26","fds"]
[null,"2028-08-27","fds"]
[null,"2028-08-28","s"]
[null,"2028-08-29","s"]
[null,"2028-08-30","s"]
[null,"2028-08-31","s"]
[null,"2028-09-01","s"]
[null,"2028-09-02","fds"]
[null,"2028-09-03","fds"]
[null,"2028-09-04","s","oui"]
[null,"2028-09-05","s"]
[null,"2028-09-06","s"]
[null,"2028-09-07","s"]
[null,"2028-09-08","s"]
[null,"2028-09-09","fds"]
[null,"2028-09-10","fds"]
[null,"2028-09-11","s"]
[null,"2028-09-12","s"]
[null,"2028-09-13","s"]
[null,"2028-09-14","s"]
[null,"2028-09-15","s"]
[null,"2028-09-16","fds"]
[null,"2028-09-17","fds"]
[null,"2028-09-18","s"]
[null,"2028-09-19","s"]
[null,"2028-09-20","s"]
[null,"2028-09-21","s"]
[null,"2028-09-22","s"]
[null,"2028-09-23","fds"]
[null,"2028-09-24","fds"]
[null,"2028-09-25","s"]
[null,"2028-09-26","s"]
[null,"2028-09-27","s"]
[null,"2028-09-28","s"]
[null,"2028-09-29","s"]
[null,"2028-09-30","fds"]
[null,"2028-10-01","fds"]
[null,"2028-10-02","s"]
[null,"2028-10-03","s"]
[null,"2028-10-04","s"]
[null,"2028-10-05","s"]
[null,"2028-10-06","s"]
[null,"2028-10-07","fds"]
[null,"2028-10-08","fds"]
[null,"2028-10-09","s","oui"]
[null,"2028-10-10","s"]
[null,"2028-10-11","s"]
[null,"2028-10-12","s"]
[null,"2028-10-13","s"]
[null,"2028-10-14","fds"]
[null,"2028-10-15","fds"]
[null,"2028-10-16","s"]
[null,"2028-10-17","s"]
[null,"2028-10-18","s"]
[null,"2028-10-19","s"]
[null,"2028-10-20","s"]
[null,"2028-10-21","fds"]
[null,"2028-10-22","fds"]
[null,"2028-10-23","s"]
[null,"2028-10-24","s"]
[null,"2028-10-25","s"]
[null,"2028-10-26","s"]
[null,"2028-10-27","s"]
[null,"2028-10-28","fds"]
[null,"2028-10-29","fds"]
[null,"2028-10-30","s"]
[null,"2028-10-31","s"]
[null,"2028-11-01","s"]
[null,"2028-11-02","s"]
[null,"2028-11-03","s"]
[null,"2028-11-04","fds"]
[null,"2028-11-05","fds"]
[null,"2028-11-06","s"]
[null,"2028-11-07","s"]
[null,"2028-11-08","s"]
[null,"2028-11-09","s"]
[null,"2028-11-10","s"]
[null,"2028-11-11","fds"]
[null,"2028-11-12","fds"]
[null,"2028-11-13","s"]
[null,"2028-11-14","s"]
[null,"2028-11-15","s"]
[null,"2028-11-16","s"]
[null,"2028-11-17","s"]
[null,"2028-11-18","fds"]
[null,"2028-11-19","fds"]
[null,"2028-11-20","s"]
[null,"2028-11-21","s"]
[null,"2028-11-22","s"]
[null,"2028-11-23","s"]
[null,"2028-11-24","s"]
[null,"2028-11-25","fds"]
[null,"2028-11-26","fds"]
[null,"2028-11-27","s"]
[null,"2028-11-28","s"]
[null,"2028-11-29","s"]
[null,"2028-11-30","s"]
[null,"2028-12-01","s"]
[null,"2028-12-02","fds"]
[null,"2028-12-03","fds"]
[null,"2028-12-04","s"]
[null,"2028-12-05","s"]
[null,"2028-12-06","s"]
[null,"2028-12-07","s"]
[null,"2028-12-08","s"]
[null,"2028-12-09","fds"]
[null,"2028-12-10","fds"]
[null,"2028-12-11","s"]
[null,"2028-12-12","s"]
[null,"2028-12-13","s"]
[null,"2028-12-14","s"]
[null,"2028-12-15","s"]
[null,"2028-12-16","fds"]
[null,"2028-12-17","fds"]
[null,"2028-12-18","s"]
[null,"2028-12-19","s"]
[null,"2028-12-20","s"]
[null,"2028-12-21","s"]
[null,"2028-12-22","s"]
[null,"2028-12-23","fds"]
[null,"2028-12-24","fds","oui"]
[null,"2028-12-25","s","oui"]
[null,"2028-12-26","s","oui"]
[null,"2028-12-27","s"]
[null,"2028-12-28","s"]
[null,"2028-12-29","s"]
[null,"2028-12-30","fds"]
[null,"2028-12-31","fds","oui"]
[null,"2029-01-01","s","oui"]
[null,"2029-01-02","s","oui"]
[null,"2029-01-03","s"]
[null,"2029-01-04","s"]
[null,"2029-01-05","s"]
[null,"2029-01-06","fds"]
[null,"2029-01-07","fds"]
[null,"2029-01-08","s"]
[null,"2029-01-09","s"]
[null,"2029-01-10","s"]
[null,"2029-01-11","s"]
[null,"2029-01-12","s"]
[null,"2029-01-13","fds"]
[null,"2029-01-14","fds"]
[null,"2029-01-15","s"]
[null,"2029-01-16","s"]
[null,"2029-01-17","s"]
[null,"2029-01-18","s"]
[null,"2029-01-19","s"]
[null,"2029-01-20","fds"]
[null,"2029-01-21","fds"]
[null,"2029-01-22","s"]
[null,"2029-01-23","s"]
[null,"2029-01-24","s"]
[null,"2029-01-25","s"]
[null,"2029-01-26","s"]
[null,"2029-01-27","fds"]
[null,"2029-01-28","fds"]
[null,"2029-01-29","s"]
[null,"2029-01-30","s"]
[null,"2029-01-31","s"]
[null,"2029-02-01","s"]
[null,"2029-02-02","s"]
[null,"2029-02-03","fds"]
[null,"2029-02-04","fds"]
[null,"2029-02-05","s"]
[null,"2029-02-06","s"]
[null,"2029-02-07","s"]
[null,"2029-02-08","s"]
[null,"2029-02-09","s"]
[null,"2029-02-10","fds"]
[null,"2029-02-11","fds"]
[null,"2029-02-12","s"]
[null,"2029-02-13","s"]
[null,"2029-02-14","s"]
[null,"2029-02-15","s"]
[null,"2029-02-16","s"]
[null,"2029-02-17","fds"]
[null,"2029-02-18","fds"]
[null,"2029-02-19","s"]
[null,"2029-02-20","s"]
[null,"2029-02-21","s"]
[null,"2029-02-22","s"]
[null,"2029-02-23","s"]
[null,"2029-02-24","fds"]
[null,"2029-02-25","fds"]
[null,"2029-02-26","s"]
[null,"2029-02-27","s"]
[null,"2029-02-28","s"]
[null,"2029-03-01","s"]
[null,"2029-03-02","s"]
[null,"2029-03-03","fds"]
[null,"2029-03-04","fds"]
[null,"2029-03-05","s"]
[null,"2029-03-06","s"]
[null,"2029-03-07","s"]
[null,"2029-03-08","s"]
[null,"2029-03-09","s"]
[null,"2029-03-10","fds"]
[null,"2029-03-11","fds"]
[null,"2029-03-12","s"]
[null,"2029-03-13","s"]
[null,"2029-03-14","s"]
[null,"2029-03-15","s"]
[null,"2029-03-16","s"]
[null,"2029-03-17","fds"]
[null,"2029-03-18","fds"]
[null,"2029-03-19","s"]
[null,"2029-03-20","s"]
[null,"2029-03-21","s"]
[null,"2029-03-22","s"]
[null,"2029-03-23","s"]
[null,"2029-03-24","fds"]
[null,"2029-03-25","fds"]
[null,"2029-03-26","s"]
[null,"2029-03-27","s"]
[null,"2029-03-28","s"]
[null,"2029-03-29","s"]
[null,"2029-03-30","s","oui"]
[null,"2029-03-31","fds"]
[null,"2029-04-01","fds"]
[null,"2029-04-02","s","oui"]
[null,"2029-04-03","s"]
[null,"2029-04-04","s"]
[null,"2029-04-05","s"]
[null,"2029-04-06","s"]
[null,"2029-04-07","fds"]
[null,"2029-04-08","fds"]
[null,"2029-04-09","s"]
[null,"2029-04-10","s"]
[null,"2029-04-11","s"]
[null,"2029-04-12","s"]
[null,"2029-04-13","s"]
[null,"2029-04-14","fds"]
[null,"2029-04-15","fds"]
[null,"2029-04-16","s"]
[null,"2029-04-17","s"]
[null,"2029-04-18","s"]
[null,"2029-04-19","s"]
[null,"2029-04-20","s"]
[null,"2029-04-21","fds"]
[null,"2029-04-22","fds"]
[null,"2029-04-23","s"]
[null,"2029-04-24","s"]
[null,"2029-04-25","s"]
[null,"2029-04-26","s"]
[null,"2029-04-27","s"]
[null,"2029-04-28","fds"]
[null,"2029-04-29","fds"]
[null,"2029-04-30","s"]
[null,"2029-05-01","s"]
[null,"2029-05-02","s"]
[null,"2029-05-03","s"]
[null,"2029-05-04","s"]
[null,"2029-05-05","fds"]
[null,"2029-05-06","fds"]
[null,"2029-05-07","s"]
[null,"2029-05-08","s"]
[null,"2029-05-09","s"]
[null,"2029-05-10","s"]
[null,"2029-05-11","s"]
[null,"2029-05-12","fds"]
[null,"2029-05-13","fds"]
[null,"2029-05-14","s"]
[null,"2029-05-15","s"]
[null,"2029-05-16","s"]
[null,"2029-05-17","s"]
[null,"2029-05-18","s"]
[null,"2029-05-19","fds"]
[null,"2029-05-20","fds"]
[null,"2029-05-21","s","oui"]
[null,"2029-05-22","s"]
[null,"2029-05-23","s"]
[null,"2029-05-24","s"]
[null,"2029-05-25","s"]
[null,"2029-05-26","fds"]
[null,"2029-05-27","fds"]
[null,"2029-05-28","s"]
[null,"2029-05-29","s"]
[null,"2029-05-30","s"]
[null,"2029-05-31","s"]
[null,"2029-06-01","s"]
[null,"2029-06-02","fds"]
[null,"2029-06-03","fds"]
[null,"2029-06-04","s"]
[null,"2029-06-05","s"]
[null,"2029-06-06","s"]
[null,"2029-06-07","s"]
[null,"2029-06-08","s"]
[null,"2029-06-09","fds"]
[null,"2029-06-10","fds"]
[null,"2029-06-11","s"]
[null,"2029-06-12","s"]
[null,"2029-06-13","s"]
[null,"2029-06-14","s"]
[null,"2029-06-15","s"]
[null,"2029-06-16","fds"]
[null,"2029-06-17","fds"]
[null,"2029-06-18","s"]
[null,"2029-06-19","s"]
[null,"2029-06-20","s"]
[null,"2029-06-21","s"]
[null,"2029-06-22","s"]
[null,"2029-06-23","fds"]
[null,"2029-06-24","fds","oui"]
[null,"2029-06-25","s"]
[null,"2029-06-26","s"]
[null,"2029-06-27","s"]
[null,"2029-06-28","s"]
[null,"2029-06-29","s"]
[null,"2029-06-30","fds"]
[null,"2029-07-01","fds","oui"]
[null,"2029-07-02","s"]
[null,"2029-07-03","s"]
[null,"2029-07-04","s"]
[null,"2029-07-05","s"]
[null,"2029-07-06","s"]
[null,"2029-07-07","fds"]
[null,"2029-07-08","fds"]
[null,"2029-07-09","s"]
[null,"2029-07-10","s"]
[null,"2029-07-11","s"]
[null,"2029-07-12","s"]
[null,"2029-07-13","s"]
[null,"2029-07-14","fds"]
[null,"2029-07-15","fds"]
[null,"2029-07-16","s"]
[null,"2029-07-17","s"]
[null,"2029-07-18","s"]
[null,"2029-07-19","s"]
[null,"2029-07-20","s"]
[null,"2029-07-21","fds"]
[null,"2029-07-22","fds"]
[null,"2029-07-23","s"]
[null,"2029-07-24","s"]
[null,"2029-07-25","s"]
[null,"2029-07-26","s"]
[null,"2029-07-27","s"]
[null,"2029-07-28","fds"]
[null,"2029-07-29","fds"]
[null,"2029-07-30","s"]
[null,"2029-07-31","s"]
[null,"2029-08-01","s"]
[null,"2029-08-02","s"]
[null,"2029-08-03","s"]
[null,"2029-08-04","fds"]
[null,"2029-08-05","fds"]
[null,"2029-08-06","s"]
[null,"2029-08-07","s"]
[null,"2029-08-08","s"]
[null,"2029-08-09","s"]
[null,"2029-08-10","s"]
[null,"2029-08-11","fds"]
[null,"2029-08-12","fds"]
[null,"2029-08-13","s"]
[null,"2029-08-14","s"]
[null,"2029-08-15","s"]
[null,"2029-08-16","s"]
[null,"2029-08-17","s"]
[null,"2029-08-18","fds"]
[null,"2029-08-19","fds"]
[null,"2029-08-20","s"]
[null,"2029-08-21","s"]
[null,"2029-08-22","s"]
[null,"2029-08-23","s"]
[null,"2029-08-24","s"]
[null,"2029-08-25","fds"]
[null,"2029-08-26","fds"]
[null,"2029-08-27","s"]
[null,"2029-08-28","s"]
[null,"2029-08-29","s"]
[null,"2029-08-30","s"]
[null,"2029-08-31","s"]
[null,"2029-09-01","fds"]
[null,"2029-09-02","fds"]
[null,"2029-09-03","s","oui"]
[null,"2029-09-04","s"]
[null,"2029-09-05","s"]
[null,"2029-09-06","s"]
[null,"2029-09-07","s"]
[null,"2029-09-08","fds"]
[null,"2029-09-09","fds"]
[null,"2029-09-10","s"]
[null,"2029-09-11","s"]
[null,"2029-09-12","s"]
[null,"2029-09-13","s"]
[null,"2029-09-14","s"]
[null,"2029-09-15","fds"]
[null,"2029-09-16","fds"]
[null,"2029-09-17","s"]
[null,"2029-09-18","s"]
[null,"2029-09-19","s"]
[null,"2029-09-20","s"]
[null,"2029-09-21","s"]
[null,"2029-09-22","fds"]
[null,"2029-09-23","fds"]
[null,"2029-09-24","s"]
[null,"2029-09-25","s"]
[null,"2029-09-26","s"]
[null,"2029-09-27","s"]
[null,"2029-09-28","s"]
[null,"2029-09-29","fds"]
[null,"2029-09-30","fds"]
[null,"2029-10-01","s"]
[null,"2029-10-02","s"]
[null,"2029-10-03","s"]
[null,"2029-10-04","s"]
[null,"2029-10-05","s"]
[null,"2029-10-06","fds"]
[null,"2029-10-07","fds"]
[null,"2029-10-08","s","oui"]
[null,"2029-10-09","s"]
[null,"2029-10-10","s"]
[null,"2029-10-11","s"]
[null,"2029-10-12","s"]
[null,"2029-10-13","fds"]
[null,"2029-10-14","fds"]
[null,"2029-10-15","s"]
[null,"2029-10-16","s"]
[null,"2029-10-17","s"]
[null,"2029-10-18","s"]
[null,"2029-10-19","s"]
[null,"2029-10-20","fds"]
[null,"2029-10-21","fds"]
[null,"2029-10-22","s"]
[null,"2029-10-23","s"]
[null,"2029-10-24","s"]
[null,"2029-10-25","s"]
[null,"2029-10-26","s"]
[null,"2029-10-27","fds"]
[null,"2029-10-28","fds"]
[null,"2029-10-29","s"]
[null,"2029-10-30","s"]
[null,"2029-10-31","s"]
[null,"2029-11-01","s"]
[null,"2029-11-02","s"]
[null,"2029-11-03","fds"]
[null,"2029-11-04","fds"]
[null,"2029-11-05","s"]
[null,"2029-11-06","s"]
[null,"2029-11-07","s"]
[null,"2029-11-08","s"]
[null,"2029-11-09","s"]
[null,"2029-11-10","fds"]
[null,"2029-11-11","fds"]
[null,"2029-11-12","s"]
[null,"2029-11-13","s"]
[null,"2029-11-14","s"]
[null,"2029-11-15","s"]
[null,"2029-11-16","s"]
[null,"2029-11-17","fds"]
[null,"2029-11-18","fds"]
[null,"2029-11-19","s"]
[null,"2029-11-20","s"]
[null,"2029-11-21","s"]
[null,"2029-11-22","s"]
[null,"2029-11-23","s"]
[null,"2029-11-24","fds"]
[null,"2029-11-25","fds"]
[null,"2029-11-26","s"]
[null,"2029-11-27","s"]
[null,"2029-11-28","s"]
[null,"2029-11-29","s"]
[null,"2029-11-30","s"]
[null,"2029-12-01","fds"]
[null,"2029-12-02","fds"]
[null,"2029-12-03","s"]
[null,"2029-12-04","s"]
[null,"2029-12-05","s"]
[null,"2029-12-06","s"]
[null,"2029-12-07","s"]
[null,"2029-12-08","fds"]
[null,"2029-12-09","fds"]
[null,"2029-12-10","s"]
[null,"2029-12-11","s"]
[null,"2029-12-12","s"]
[null,"2029-12-13","s"]
[null,"2029-12-14","s"]
[null,"2029-12-15","fds"]
[null,"2029-12-16","fds"]
[null,"2029-12-17","s"]
[null,"2029-12-18","s"]
[null,"2029-12-19","s"]
[null,"2029-12-20","s"]
[null,"2029-12-21","s"]
[null,"2029-12-22","fds"]
[null,"2029-12-23","fds"]
[null,"2029-12-24","s","oui"]
[null,"2029-12-25","s","oui"]
[null,"2029-12-26","s","oui"]
[null,"2029-12-27","s"]
[null,"2029-12-28","s"]
[null,"2029-12-29","fds"]
[null,"2029-12-30","fds"]
[null,"2029-12-31","s","oui"]
[null,"2030-01-01","s","oui"]
[null,"2030-01-02","s","oui"]
[null,"2030-01-03","s"]
[null,"2030-01-04","s"]
[null,"2030-01-05","fds"]
[null,"2030-01-06","fds"]
[null,"2030-01-07","s"]
[null,"2030-01-08","s"]
[null,"2030-01-09","s"]
[null,"2030-01-10","s"]
[null,"2030-01-11","s"]
[null,"2030-01-12","fds"]
[null,"2030-01-13","fds"]
[null,"2030-01-14","s"]
[null,"2030-01-15","s"]
[null,"2030-01-16","s"]
[null,"2030-01-17","s"]
[null,"2030-01-18","s"]
[null,"2030-01-19","fds"]
[null,"2030-01-20","fds"]
[null,"2030-01-21","s"]
[null,"2030-01-22","s"]
[null,"2030-01-23","s"]
[null,"2030-01-24","s"]
[null,"2030-01-25","s"]
[null,"2030-01-26","fds"]
[null,"2030-01-27","fds"]
[null,"2030-01-28","s"]
[null,"2030-01-29","s"]
[null,"2030-01-30","s"]
[null,"2030-01-31","s"]
[null,"2030-02-01","s"]
[null,"2030-02-02","fds"]
[null,"2030-02-03","fds"]
[null,"2030-02-04","s"]
[null,"2030-02-05","s"]
[null,"2030-02-06","s"]
[null,"2030-02-07","s"]
[null,"2030-02-08","s"]
[null,"2030-02-09","fds"]
[null,"2030-02-10","fds"]
[null,"2030-02-11","s"]
[null,"2030-02-12","s"]
[null,"2030-02-13","s"]
[null,"2030-02-14","s"]
[null,"2030-02-15","s"]
[null,"2030-02-16","fds"]
[null,"2030-02-17","fds"]
[null,"2030-02-18","s"]
[null,"2030-02-19","s"]
[null,"2030-02-20","s"]
[null,"2030-02-21","s"]
[null,"2030-02-22","s"]
[null,"2030-02-23","fds"]
[null,"2030-02-24","fds"]
[null,"2030-02-25","s"]
[null,"2030-02-26","s"]
[null,"2030-02-27","s"]
[null,"2030-02-28","s"]
[null,"2030-03-01","s"]
[null,"2030-03-02","fds"]
[null,"2030-03-03","fds"]
[null,"2030-03-04","s"]
[null,"2030-03-05","s"]
[null,"2030-03-06","s"]
[null,"2030-03-07","s"]
[null,"2030-03-08","s"]
[null,"2030-03-09","fds"]
[null,"2030-03-10","fds"]
[null,"2030-03-11","s"]
[null,"2030-03-12","s"]
[null,"2030-03-13","s"]
[null,"2030-03-14","s"]
[null,"2030-03-15","s"]
[null,"2030-03-16","fds"]
[null,"2030-03-17","fds"]
[null,"2030-03-18","s"]
[null,"2030-03-19","s"]
[null,"2030-03-20","s"]
[null,"2030-03-21","s"]
[null,"2030-03-22","s"]
[null,"2030-03-23","fds"]
[null,"2030-03-24","fds"]
[null,"2030-03-25","s"]
[null,"2030-03-26","s"]
[null,"2030-03-27","s"]
[null,"2030-03-28","s"]
[null,"2030-03-29","s"]
[null,"2030-03-30","fds"]
[null,"2030-03-31","fds"]
[null,"2030-04-01","s"]
[null,"2030-04-02","s"]
[null,"2030-04-03","s"]
[null,"2030-04-04","s"]
[null,"2030-04-05","s"]
[null,"2030-04-06","fds"]
[null,"2030-04-07","fds"]
[null,"2030-04-08","s"]
[null,"2030-04-09","s"]
[null,"2030-04-10","s"]
[null,"2030-04-11","s"]
[null,"2030-04-12","s"]
[null,"2030-04-13","fds"]
[null,"2030-04-14","fds"]
[null,"2030-04-15","s"]
[null,"2030-04-16","s"]
[null,"2030-04-17","s"]
[null,"2030-04-18","s"]
[null,"2030-04-19","s","oui"]
[null,"2030-04-20","fds"]
[null,"2030-04-21","fds"]
[null,"2030-04-22","s","oui"]
[null,"2030-04-23","s"]
[null,"2030-04-24","s"]
[null,"2030-04-25","s"]
[null,"2030-04-26","s"]
[null,"2030-04-27","fds"]
[null,"2030-04-28","fds"]
[null,"2030-04-29","s"]
[null,"2030-04-30","s"]
[null,"2030-05-01","s"]
[null,"2030-05-02","s"]
[null,"2030-05-03","s"]
[null,"2030-05-04","fds"]
[null,"2030-05-05","fds"]
[null,"2030-05-06","s"]
[null,"2030-05-07","s"]
[null,"2030-05-08","s"]
[null,"2030-05-09","s"]
[null,"2030-05-10","s"]
[null,"2030-05-11","fds"]
[null,"2030-05-12","fds"]
[null,"2030-05-13","s"]
[null,"2030-05-14","s"]
[null,"2030-05-15","s"]
[null,"2030-05-16","s"]
[null,"2030-05-17","s"]
[null,"2030-05-18","fds"]
[null,"2030-05-19","fds"]
[null,"2030-05-20","s","oui"]
[null,"2030-05-21","s"]
[null,"2030-05-22","s"]
[null,"2030-05-23","s"]
[null,"2030-05-24","s"]
[null,"2030-05-25","fds"]
[null,"2030-05-26","fds"]
[null,"2030-05-27","s"]
[null,"2030-05-28","s"]
[null,"2030-05-29","s"]
[null,"2030-05-30","s"]
[null,"2030-05-31","s"]
[null,"2030-06-01","fds"]
[null,"2030-06-02","fds"]
[null,"2030-06-03","s"]
[null,"2030-06-04","s"]
[null,"2030-06-05","s"]
[null,"2030-06-06","s"]
[null,"2030-06-07","s"]
[null,"2030-06-08","fds"]
[null,"2030-06-09","fds"]
[null,"2030-06-10","s"]
[null,"2030-06-11","s"]
[null,"2030-06-12","s"]
[null,"2030-06-13","s"]
[null,"2030-06-14","s"]
[null,"2030-06-15","fds"]
[null,"2030-06-16","fds"]
[null,"2030-06-17","s"]
[null,"2030-06-18","s"]
[null,"2030-06-19","s"]
[null,"2030-06-20","s"]
[null,"2030-06-21","s"]
[null,"2030-06-22","fds"]
[null,"2030-06-23","fds"]
[null,"2030-06-24","s","oui"]
[null,"2030-06-25","s"]
[null,"2030-06-26","s"]
[null,"2030-06-27","s"]
[null,"2030-06-28","s"]
[null,"2030-06-29","fds"]
[null,"2030-06-30","fds"]
[null,"2030-07-01","s","oui"]
[null,"2030-07-02","s"]
[null,"2030-07-03","s"]
[null,"2030-07-04","s"]
[null,"2030-07-05","s"]
[null,"2030-07-06","fds"]
[null,"2030-07-07","fds"]
[null,"2030-07-08","s"]
[null,"2030-07-09","s"]
[null,"2030-07-10","s"]
[null,"2030-07-11","s"]
[null,"2030-07-12","s"]
[null,"2030-07-13","fds"]
[null,"2030-07-14","fds"]
[null,"2030-07-15","s"]
[null,"2030-07-16","s"]
[null,"2030-07-17","s"]
[null,"2030-07-18","s"]
[null,"2030-07-19","s"]
[null,"2030-07-20","fds"]
[null,"2030-07-21","fds"]
[null,"2030-07-22","s"]
[null,"2030-07-23","s"]
[null,"2030-07-24","s"]
[null,"2030-07-25","s"]
[null,"2030-07-26","s"]
[null,"2030-07-27","fds"]
[null,"2030-07-28","fds"]
[null,"2030-07-29","s"]
[null,"2030-07-30","s"]
[null,"2030-07-31","s"]
[null,"2030-08-01","s"]
[null,"2030-08-02","s"]
[null,"2030-08-03","fds"]
[null,"2030-08-04","fds"]
[null,"2030-08-05","s"]
[null,"2030-08-06","s"]
[null,"2030-08-07","s"]
[null,"2030-08-08","s"]
[null,"2030-08-09","s"]
[null,"2030-08-10","fds"]
[null,"2030-08-11","fds"]
[null,"2030-08-12","s"]
[null,"2030-08-13","s"]
[null,"2030-08-14","s"]
[null,"2030-08-15","s"]
[null,"2030-08-16","s"]
[null,"2030-08-17","fds"]
[null,"2030-08-18","fds"]
[null,"2030-08-19","s"]
[null,"2030-08-20","s"]
[null,"2030-08-21","s"]
[null,"2030-08-22","s"]
[null,"2030-08-23","s"]
[null,"2030-08-24","fds"]
[null,"2030-08-25","fds"]
[null,"2030-08-26","s"]
[null,"2030-08-27","s"]
[null,"2030-08-28","s"]
[null,"2030-08-29","s"]
[null,"2030-08-30","s"]
[null,"2030-08-31","fds"]
[null,"2030-09-01","fds"]
[null,"2030-09-02","s","oui"]
[null,"2030-09-03","s"]
[null,"2030-09-04","s"]
[null,"2030-09-05","s"]
[null,"2030-09-06","s"]
[null,"2030-09-07","fds"]
[null,"2030-09-08","fds"]
[null,"2030-09-09","s"]
[null,"2030-09-10","s"]
[null,"2030-09-11","s"]
[null,"2030-09-12","s"]
[null,"2030-09-13","s"]
[null,"2030-09-14","fds"]
[null,"2030-09-15","fds"]
[null,"2030-09-16","s"]
[null,"2030-09-17","s"]
[null,"2030-09-18","s"]
[null,"2030-09-19","s"]
[null,"2030-09-20","s"]
[null,"2030-09-21","fds"]
[null,"2030-09-22","fds"]
[null,"2030-09-23","s"]
[null,"2030-09-24","s"]
[null,"2030-09-25","s"]
[null,"2030-09-26","s"]
[null,"2030-09-27","s"]
[null,"2030-09-28","fds"]
[null,"2030-09-29","fds"]
[null,"2030-09-30","s"]
[null,"2030-10-01","s"]
[null,"2030-10-02","s"]
[null,"2030-10-03","s"]
[null,"2030-10-04","s"]
[null,"2030-10-05","fds"]
[null,"2030-10-06","fds"]
[null,"2030-10-07","s"]
[null,"2030-10-08","s"]
[null,"2030-10-09","s"]
[null,"2030-10-10","s"]
[null,"2030-10-11","s"]
[null,"2030-10-12","fds"]
[null,"2030-10-13","fds"]
[null,"2030-10-14","s","oui"]
[null,"2030-10-15","s"]
[null,"2030-10-16","s"]
[null,"2030-10-17","s"]
[null,"2030-10-18","s"]
[null,"2030-10-19","fds"]
[null,"2030-10-20","fds"]
[null,"2030-10-21","s"]
[null,"2030-10-22","s"]
[null,"2030-10-23","s"]
[null,"2030-10-24","s"]
[null,"2030-10-25","s"]
[null,"2030-10-26","fds"]
[null,"2030-10-27","fds"]
[null,"2030-10-28","s"]
[null,"2030-10-29","s"]
[null,"2030-10-30","s"]
[null,"2030-10-31","s"]
[null,"2030-11-01","s"]
[null,"2030-11-02","fds"]
[null,"2030-11-03","fds"]
[null,"2030-11-04","s"]
[null,"2030-11-05","s"]
[null,"2030-11-06","s"]
[null,"2030-11-07","s"]
[null,"2030-11-08","s"]
[null,"2030-11-09","fds"]
[null,"2030-11-10","fds"]
[null,"2030-11-11","s"]
[null,"2030-11-12","s"]
[null,"2030-11-13","s"]
[null,"2030-11-14","s"]
[null,"2030-11-15","s"]
[null,"2030-11-16","fds"]
[null,"2030-11-17","fds"]
[null,"2030-11-18","s"]
[null,"2030-11-19","s"]
[null,"2030-11-20","s"]
[null,"2030-11-21","s"]
[null,"2030-11-22","s"]
[null,"2030-11-23","fds"]
[null,"2030-11-24","fds"]
[null,"2030-11-25","s"]
[null,"2030-11-26","s"]
[null,"2030-11-27","s"]
[null,"2030-11-28","s"]
[null,"2030-11-29","s"]
[null,"2030-11-30","fds"]
[null,"2030-12-01","fds"]
[null,"2030-12-02","s"]
[null,"2030-12-03","s"]
[null,"2030-12-04","s"]
[null,"2030-12-05","s"]
[null,"2030-12-06","s"]
[null,"2030-12-07","fds"]
[null,"2030-12-08","fds"]
[null,"2030-12-09","s"]
[null,"2030-12-10","s"]
[null,"2030-12-11","s"]
[null,"2030-12-12","s"]
[null,"2030-12-13","s"]
[null,"2030-12-14","fds"]
[null,"2030-12-15","fds"]
[null,"2030-12-16","s"]
[null,"2030-12-17","s"]
[null,"2030-12-18","s"]
[null,"2030-12-19","s"]
[null,"2030-12-20","s"]
[null,"2030-12-21","fds"]
[null,"2030-12-22","fds"]
[null,"2030-12-23","s"]
[null,"2030-12-24","s","oui"]
[null,"2030-12-25","s","oui"]
[null,"2030-12-26","s","oui"]
[null,"2030-12-27","s"]
[null,"2030-12-28","fds"]
[null,"2030-12-29","fds"]
[null,"2030-12-30","s"]
[null,"2030-12-31","s","oui"]
[null,"2031-01-01","s","oui"]
[null,"2031-01-02","s","oui"]
[null,"2031-01-03","s"]
[null,"2031-01-04","fds"]
[null,"2031-01-05","fds"]
[null,"2031-01-06","s"]
[null,"2031-01-07","s"]
[null,"2031-01-08","s"]
[null,"2031-01-09","s"]
[null,"2031-01-10","s"]
[null,"2031-01-11","fds"]
[null,"2031-01-12","fds"]
[null,"2031-01-13","s"]
[null,"2031-01-14","s"]
[null,"2031-01-15","s"]
[null,"2031-01-16","s"]
[null,"2031-01-17","s"]
[null,"2031-01-18","fds"]
[null,"2031-01-19","fds"]
[null,"2031-01-20","s"]
[null,"2031-01-21","s"]
[null,"2031-01-22","s"]
[null,"2031-01-23","s"]
[null,"2031-01-24","s"]
[null,"2031-01-25","fds"]
[null,"2031-01-26","fds"]
[null,"2031-01-27","s"]
[null,"2031-01-28","s"]
[null,"2031-01-29","s"]
[null,"2031-01-30","s"]
[null,"2031-01-31","s"]
[null,"2031-02-01","fds"]
[null,"2031-02-02","fds"]
[null,"2031-02-03","s"]
[null,"2031-02-04","s"]
[null,"2031-02-05","s"]
[null,"2031-02-06","s"]
[null,"2031-02-07","s"]
[null,"2031-02-08","fds"]
[null,"2031-02-09","fds"]
[null,"2031-02-10","s"]
[null,"2031-02-11","s"]
[null,"2031-02-12","s"]
[null,"2031-02-13","s"]
[null,"2031-02-14","s"]
[null,"2031-02-15","fds"]
[null,"2031-02-16","fds"]
[null,"2031-02-17","s"]
[null,"2031-02-18","s"]
[null,"2031-02-19","s"]
[null,"2031-02-20","s"]
[null,"2031-02-21","s"]
[null,"2031-02-22","fds"]
[null,"2031-02-23","fds"]
[null,"2031-02-24","s"]
[null,"2031-02-25","s"]
[null,"2031-02-26","s"]
[null,"2031-02-27","s"]
[null,"2031-02-28","s"]
[null,"2031-03-01","fds"]
[null,"2031-03-02","fds"]
[null,"2031-03-03","s"]
[null,"2031-03-04","s"]
[null,"2031-03-05","s"]
[null,"2031-03-06","s"]
[null,"2031-03-07","s"]
[null,"2031-03-08","fds"]
[null,"2031-03-09","fds"]
[null,"2031-03-10","s"]
[null,"2031-03-11","s"]
[null,"2031-03-12","s"]
[null,"2031-03-13","s"]
[null,"2031-03-14","s"]
[null,"2031-03-15","fds"]
[null,"2031-03-16","fds"]
[null,"2031-03-17","s"]
[null,"2031-03-18","s"]
[null,"2031-03-19","s"]
[null,"2031-03-20","s"]
[null,"2031-03-21","s"]
[null,"2031-03-22","fds"]
[null,"2031-03-23","fds"]
[null,"2031-03-24","s"]
[null,"2031-03-25","s"]
[null,"2031-03-26","s"]
[null,"2031-03-27","s"]
[null,"2031-03-28","s"]
[null,"2031-03-29","fds"]
[null,"2031-03-30","fds"]
[null,"2031-03-31","s"]
[null,"2031-04-01","s"]
[null,"2031-04-02","s"]
[null,"2031-04-03","s"]
[null,"2031-04-04","s"]
[null,"2031-04-05","fds"]
[null,"2031-04-06","fds"]
[null,"2031-04-07","s"]
[null,"2031-04-08","s"]
[null,"2031-04-09","s"]
[null,"2031-04-10","s"]
[null,"2031-04-11","s","oui"]
[null,"2031-04-12","fds"]
[null,"2031-04-13","fds"]
[null,"2031-04-14","s","oui"]
[null,"2031-04-15","s"]
[null,"2031-04-16","s"]
[null,"2031-04-17","s"]
[null,"2031-04-18","s"]
[null,"2031-04-19","fds"]
[null,"2031-04-20","fds"]
[null,"2031-04-21","s"]
[null,"2031-04-22","s"]
[null,"2031-04-23","s"]
[null,"2031-04-24","s"]
[null,"2031-04-25","s"]
[null,"2031-04-26","fds"]
[null,"2031-04-27","fds"]
[null,"2031-04-28","s"]
[null,"2031-04-29","s"]
[null,"2031-04-30","s"]
[null,"2031-05-01","s"]
[null,"2031-05-02","s"]
[null,"2031-05-03","fds"]
[null,"2031-05-04","fds"]
[null,"2031-05-05","s"]
[null,"2031-05-06","s"]
[null,"2031-05-07","s"]
[null,"2031-05-08","s"]
[null,"2031-05-09","s"]
[null,"2031-05-10","fds"]
[null,"2031-05-11","fds"]
[null,"2031-05-12","s"]
[null,"2031-05-13","s"]
[null,"2031-05-14","s"]
[null,"2031-05-15","s"]
[null,"2031-05-16","s"]
[null,"2031-05-17","fds"]
[null,"2031-05-18","fds"]
[null,"2031-05-19","s","oui"]
[null,"2031-05-20","s"]
[null,"2031-05-21","s"]
[null,"2031-05-22","s"]
[null,"2031-05-23","s"]
[null,"2031-05-24","fds"]
[null,"2031-05-25","fds"]
[null,"2031-05-26","s"]
[null,"2031-05-27","s"]
[null,"2031-05-28","s"]
[null,"2031-05-29","s"]
[null,"2031-05-30","s"]
[null,"2031-05-31","fds"]
[null,"2031-06-01","fds"]
[null,"2031-06-02","s"]
[null,"2031-06-03","s"]
[null,"2031-06-04","s"]
[null,"2031-06-05","s"]
[null,"2031-06-06","s"]
[null,"2031-06-07","fds"]
[null,"2031-06-08","fds"]
[null,"2031-06-09","s"]
[null,"2031-06-10","s"]
[null,"2031-06-11","s"]
[null,"2031-06-12","s"]
[null,"2031-06-13","s"]
[null,"2031-06-14","fds"]
[null,"2031-06-15","fds"]
[null,"2031-06-16","s"]
[null,"2031-06-17","s"]
[null,"2031-06-18","s"]
[null,"2031-06-19","s"]
[null,"2031-06-20","s"]
[null,"2031-06-21","fds"]
[null,"2031-06-22","fds"]
[null,"2031-06-23","s"]
[null,"2031-06-24","s","oui"]
[null,"2031-06-25","s"]
[null,"2031-06-26","s"]
[null,"2031-06-27","s"]
[null,"2031-06-28","fds"]
[null,"2031-06-29","fds"]
[null,"2031-06-30","s"]
[null,"2031-07-01","s","oui"]
[null,"2031-07-02","s"]
[null,"2031-07-03","s"]
[null,"2031-07-04","s"]
[null,"2031-07-05","fds"]
[null,"2031-07-06","fds"]
[null,"2031-07-07","s"]
[null,"2031-07-08","s"]
[null,"2031-07-09","s"]
[null,"2031-07-10","s"]
[null,"2031-07-11","s"]
[null,"2031-07-12","fds"]
[null,"2031-07-13","fds"]
[null,"2031-07-14","s"]
[null,"2031-07-15","s"]
[null,"2031-07-16","s"]
[null,"2031-07-17","s"]
[null,"2031-07-18","s"]
[null,"2031-07-19","fds"]
[null,"2031-07-20","fds"]
[null,"2031-07-21","s"]
[null,"2031-07-22","s"]
[null,"2031-07-23","s"]
[null,"2031-07-24","s"]
[null,"2031-07-25","s"]
[null,"2031-07-26","fds"]
[null,"2031-07-27","fds"]
[null,"2031-07-28","s"]
[null,"2031-07-29","s"]
[null,"2031-07-30","s"]
[null,"2031-07-31","s"]
[null,"2031-08-01","s"]
[null,"2031-08-02","fds"]
[null,"2031-08-03","fds"]
[null,"2031-08-04","s"]
[null,"2031-08-05","s"]
[null,"2031-08-06","s"]
[null,"2031-08-07","s"]
[null,"2031-08-08","s"]
[null,"2031-08-09","fds"]
[null,"2031-08-10","fds"]
[null,"2031-08-11","s"]
[null,"2031-08-12","s"]
[null,"2031-08-13","s"]
[null,"2031-08-14","s"]
[null,"2031-08-15","s"]
[null,"2031-08-16","fds"]
[null,"2031-08-17","fds"]
[null,"2031-08-18","s"]
[null,"2031-08-19","s"]
[null,"2031-08-20","s"]
[null,"2031-08-21","s"]
[null,"2031-08-22","s"]
[null,"2031-08-23","fds"]
[null,"2031-08-24","fds"]
[null,"2031-08-25","s"]
[null,"2031-08-26","s"]
[null,"2031-08-27","s"]
[null,"2031-08-28","s"]
[null,"2031-08-29","s"]
[null,"2031-08-30","fds"]
[null,"2031-08-31","fds"]
[null,"2031-09-01","s","oui"]
[null,"2031-09-02","s"]
[null,"2031-09-03","s"]
[null,"2031-09-04","s"]
[null,"2031-09-05","s"]
[null,"2031-09-06","fds"]
[null,"2031-09-07","fds"]
[null,"2031-09-08","s"]
[null,"2031-09-09","s"]
[null,"2031-09-10","s"]
[null,"2031-09-11","s"]
[null,"2031-09-12","s"]
[null,"2031-09-13","fds"]
[null,"2031-09-14","fds"]
[null,"2031-09-15","s"]
[null,"2031-09-16","s"]
[null,"2031-09-17","s"]
[null,"2031-09-18","s"]
[null,"2031-09-19","s"]
[null,"2031-09-20","fds"]
[null,"2031-09-21","fds"]
[null,"2031-09-22","s"]
[null,"2031-09-23","s"]
[null,"2031-09-24","s"]
[null,"2031-09-25","s"]
[null,"2031-09-26","s"]
[null,"2031-09-27","fds"]
[null,"2031-09-28","fds"]
[null,"2031-09-29","s"]
[null,"2031-09-30","s"]
[null,"2031-10-01","s"]
[null,"2031-10-02","s"]
[null,"2031-10-03","s"]
[null,"2031-10-04","fds"]
[null,"2031-10-05","fds"]
[null,"2031-10-06","s"]
[null,"2031-10-07","s"]
[null,"2031-10-08","s"]
[null,"2031-10-09","s"]
[null,"2031-10-10","s"]
[null,"2031-10-11","fds"]
[null,"2031-10-12","fds"]
[null,"2031-10-13","s","oui"]
[null,"2031-10-14","s"]
[null,"2031-10-15","s"]
[null,"2031-10-16","s"]
[null,"2031-10-17","s"]
[null,"2031-10-18","fds"]
[null,"2031-10-19","fds"]
[null,"2031-10-20","s"]
[null,"2031-10-21","s"]
[null,"2031-10-22","s"]
[null,"2031-10-23","s"]
[null,"2031-10-24","s"]
[null,"2031-10-25","fds"]
[null,"2031-10-26","fds"]
[null,"2031-10-27","s"]
[null,"2031-10-28","s"]
[null,"2031-10-29","s"]
[null,"2031-10-30","s"]
[null,"2031-10-31","s"]
[null,"2031-11-01","fds"]
[null,"2031-11-02","fds"]
[null,"2031-11-03","s"]
[null,"2031-11-04","s"]
[null,"2031-11-05","s"]
[null,"2031-11-06","s"]
[null,"2031-11-07","s"]
[null,"2031-11-08","fds"]
[null,"2031-11-09","fds"]
[null,"2031-11-10","s"]
[null,"2031-11-11","s"]
[null,"2031-11-12","s"]
[null,"2031-11-13","s"]
[null,"2031-11-14","s"]
[null,"2031-11-15","fds"]
[null,"2031-11-16","fds"]
[null,"2031-11-17","s"]
[null,"2031-11-18","s"]
[null,"2031-11-19","s"]
[null,"2031-11-20","s"]
[null,"2031-11-21","s"]
[null,"2031-11-22","fds"]
[null,"2031-11-23","fds"]
[null,"2031-11-24","s"]
[null,"2031-11-25","s"]
[null,"2031-11-26","s"]
[null,"2031-11-27","s"]
[null,"2031-11-28","s"]
[null,"2031-11-29","fds"]
[null,"2031-11-30","fds"]
[null,"2031-12-01","s"]
[null,"2031-12-02","s"]
[null,"2031-12-03","s"]
[null,"2031-12-04","s"]
[null,"2031-12-05","s"]
[null,"2031-12-06","fds"]
[null,"2031-12-07","fds"]
[null,"2031-12-08","s"]
[null,"2031-12-09","s"]
[null,"2031-12-10","s"]
[null,"2031-12-11","s"]
[null,"2031-12-12","s"]
[null,"2031-12-13","fds"]
[null,"2031-12-14","fds"]
[null,"2031-12-15","s"]
[null,"2031-12-16","s"]
[null,"2031-12-17","s"]
[null,"2031-12-18","s"]
[null,"2031-12-19","s"]
[null,"2031-12-20","fds"]
[null,"2031-12-21","fds"]
[null,"2031-12-22","s"]
[null,"2031-12-23","s"]
[null,"2031-12-24","s","oui"]
[null,"2031-12-25","s","oui"]
[null,"2031-12-26","s","oui"]
[null,"2031-12-27","fds"]
[null,"2031-12-28","fds"]
[null,"2031-12-29","s"]
[null,"2031-12-30","s"]
[null,"2031-12-31","s","oui"]
[null,"2032-01-01","s","oui"]
[null,"2032-01-02","s","oui"]
[null,"2032-01-03","fds"]
[null,"2032-01-04","fds"]
[null,"2032-01-05","s"]
[null,"2032-01-06","s"]
[null,"2032-01-07","s"]
[null,"2032-01-08","s"]
[null,"2032-01-09","s"]
[null,"2032-01-10","fds"]
[null,"2032-01-11","fds"]
[null,"2032-01-12","s"]
[null,"2032-01-13","s"]
[null,"2032-01-14","s"]
[null,"2032-01-15","s"]
[null,"2032-01-16","s"]
[null,"2032-01-17","fds"]
[null,"2032-01-18","fds"]
[null,"2032-01-19","s"]
[null,"2032-01-20","s"]
[null,"2032-01-21","s"]
[null,"2032-01-22","s"]
[null,"2032-01-23","s"]
[null,"2032-01-24","fds"]
[null,"2032-01-25","fds"]
[null,"2032-01-26","s"]
[null,"2032-01-27","s"]
[null,"2032-01-28","s"]
[null,"2032-01-29","s"]
[null,"2032-01-30","s"]
[null,"2032-01-31","fds"]
[null,"2032-02-01","fds"]
[null,"2032-02-02","s"]
[null,"2032-02-03","s"]
[null,"2032-02-04","s"]
[null,"2032-02-05","s"]
[null,"2032-02-06","s"]
[null,"2032-02-07","fds"]
[null,"2032-02-08","fds"]
[null,"2032-02-09","s"]
[null,"2032-02-10","s"]
[null,"2032-02-11","s"]
[null,"2032-02-12","s"]
[null,"2032-02-13","s"]
[null,"2032-02-14","fds"]
[null,"2032-02-15","fds"]
[null,"2032-02-16","s"]
[null,"2032-02-17","s"]
[null,"2032-02-18","s"]
[null,"2032-02-19","s"]
[null,"2032-02-20","s"]
[null,"2032-02-21","fds"]
[null,"2032-02-22","fds"]
[null,"2032-02-23","s"]
[null,"2032-02-24","s"]
[null,"2032-02-25","s"]
[null,"2032-02-26","s"]
[null,"2032-02-27","s"]
[null,"2032-02-28","fds"]
[null,"2032-02-29","fds"]
[null,"2032-03-01","s"]
[null,"2032-03-02","s"]
[null,"2032-03-03","s"]
[null,"2032-03-04","s"]
[null,"2032-03-05","s"]
[null,"2032-03-06","fds"]
[null,"2032-03-07","fds"]
[null,"2032-03-08","s"]
[null,"2032-03-09","s"]
[null,"2032-03-10","s"]
[null,"2032-03-11","s"]
[null,"2032-03-12","s"]
[null,"2032-03-13","fds"]
[null,"2032-03-14","fds"]
[null,"2032-03-15","s"]
[null,"2032-03-16","s"]
[null,"2032-03-17","s"]
[null,"2032-03-18","s"]
[null,"2032-03-19","s"]
[null,"2032-03-20","fds"]
[null,"2032-03-21","fds"]
[null,"2032-03-22","s"]
[null,"2032-03-23","s"]
[null,"2032-03-24","s"]
[null,"2032-03-25","s"]
[null,"2032-03-26","s","oui"]
[null,"2032-03-27","fds"]
[null,"2032-03-28","fds"]
[null,"2032-03-29","s","oui"]
[null,"2032-03-30","s"]
[null,"2032-03-31","s"]
[null,"2032-04-01","s"]
[null,"2032-04-02","s"]
[null,"2032-04-03","fds"]
[null,"2032-04-04","fds"]
[null,"2032-04-05","s"]
[null,"2032-04-06","s"]
[null,"2032-04-07","s"]
[null,"2032-04-08","s"]
[null,"2032-04-09","s"]
[null,"2032-04-10","fds"]
[null,"2032-04-11","fds"]
[null,"2032-04-12","s"]
[null,"2032-04-13","s"]
[null,"2032-04-14","s"]
[null,"2032-04-15","s"]
[null,"2032-04-16","s"]
[null,"2032-04-17","fds"]
[null,"2032-04-18","fds"]
[null,"2032-04-19","s"]
[null,"2032-04-20","s"]
[null,"2032-04-21","s"]
[null,"2032-04-22","s"]
[null,"2032-04-23","s"]
[null,"2032-04-24","fds"]
[null,"2032-04-25","fds"]
[null,"2032-04-26","s"]
[null,"2032-04-27","s"]
[null,"2032-04-28","s"]
[null,"2032-04-29","s"]
[null,"2032-04-30","s"]
[null,"2032-05-01","fds"]
[null,"2032-05-02","fds"]
[null,"2032-05-03","s"]
[null,"2032-05-04","s"]
[null,"2032-05-05","s"]
[null,"2032-05-06","s"]
[null,"2032-05-07","s"]
[null,"2032-05-08","fds"]
[null,"2032-05-09","fds"]
[null,"2032-05-10","s"]
[null,"2032-05-11","s"]
[null,"2032-05-12","s"]
[null,"2032-05-13","s"]
[null,"2032-05-14","s"]
[null,"2032-05-15","fds"]
[null,"2032-05-16","fds"]
[null,"2032-05-17","s"]
[null,"2032-05-18","s"]
[null,"2032-05-19","s"]
[null,"2032-05-20","s"]
[null,"2032-05-21","s"]
[null,"2032-05-22","fds"]
[null,"2032-05-23","fds"]
[null,"2032-05-24","s","oui"]
[null,"2032-05-25","s"]
[null,"2032-05-26","s"]
[null,"2032-05-27","s"]
[null,"2032-05-28","s"]
[null,"2032-05-29","fds"]
[null,"2032-05-30","fds"]
[null,"2032-05-31","s"]
[null,"2032-06-01","s"]
[null,"2032-06-02","s"]
[null,"2032-06-03","s"]
[null,"2032-06-04","s"]
[null,"2032-06-05","fds"]
[null,"2032-06-06","fds"]
[null,"2032-06-07","s"]
[null,"2032-06-08","s"]
[null,"2032-06-09","s"]
[null,"2032-06-10","s"]
[null,"2032-06-11","s"]
[null,"2032-06-12","fds"]
[null,"2032-06-13","fds"]
[null,"2032-06-14","s"]
[null,"2032-06-15","s"]
[null,"2032-06-16","s"]
[null,"2032-06-17","s"]
[null,"2032-06-18","s"]
[null,"2032-06-19","fds"]
[null,"2032-06-20","fds"]
[null,"2032-06-21","s"]
[null,"2032-06-22","s"]
[null,"2032-06-23","s"]
[null,"2032-06-24","s","oui"]
[null,"2032-06-25","s"]
[null,"2032-06-26","fds"]
[null,"2032-06-27","fds"]
[null,"2032-06-28","s"]
[null,"2032-06-29","s"]
[null,"2032-06-30","s"]
[null,"2032-07-01","s","oui"]
[null,"2032-07-02","s"]
[null,"2032-07-03","fds"]
[null,"2032-07-04","fds"]
[null,"2032-07-05","s"]
[null,"2032-07-06","s"]
[null,"2032-07-07","s"]
[null,"2032-07-08","s"]
[null,"2032-07-09","s"]
[null,"2032-07-10","fds"]
[null,"2032-07-11","fds"]
[null,"2032-07-12","s"]
[null,"2032-07-13","s"]
[null,"2032-07-14","s"]
[null,"2032-07-15","s"]
[null,"2032-07-16","s"]
[null,"2032-07-17","fds"]
[null,"2032-07-18","fds"]
[null,"2032-07-19","s"]
[null,"2032-07-20","s"]
[null,"2032-07-21","s"]
[null,"2032-07-22","s"]
[null,"2032-07-23","s"]
[null,"2032-07-24","fds"]
[null,"2032-07-25","fds"]
[null,"2032-07-26","s"]
[null,"2032-07-27","s"]
[null,"2032-07-28","s"]
[null,"2032-07-29","s"]
[null,"2032-07-30","s"]
[null,"2032-07-31","fds"]
[null,"2032-08-01","fds"]
[null,"2032-08-02","s"]
[null,"2032-08-03","s"]
[null,"2032-08-04","s"]
[null,"2032-08-05","s"]
[null,"2032-08-06","s"]
[null,"2032-08-07","fds"]
[null,"2032-08-08","fds"]
[null,"2032-08-09","s"]
[null,"2032-08-10","s"]
[null,"2032-08-11","s"]
[null,"2032-08-12","s"]
[null,"2032-08-13","s"]
[null,"2032-08-14","fds"]
[null,"2032-08-15","fds"]
[null,"2032-08-16","s"]
[null,"2032-08-17","s"]
[null,"2032-08-18","s"]
[null,"2032-08-19","s"]
[null,"2032-08-20","s"]
[null,"2032-08-21","fds"]
[null,"2032-08-22","fds"]
[null,"2032-08-23","s"]
[null,"2032-08-24","s"]
[null,"2032-08-25","s"]
[null,"2032-08-26","s"]
[null,"2032-08-27","s"]
[null,"2032-08-28","fds"]
[null,"2032-08-29","fds"]
[null,"2032-08-30","s"]
[null,"2032-08-31","s"]
[null,"2032-09-01","s"]
[null,"2032-09-02","s"]
[null,"2032-09-03","s"]
[null,"2032-09-04","fds"]
[null,"2032-09-05","fds"]
[null,"2032-09-06","s","oui"]
[null,"2032-09-07","s"]
[null,"2032-09-08","s"]
[null,"2032-09-09","s"]
[null,"2032-09-10","s"]
[null,"2032-09-11","fds"]
[null,"2032-09-12","fds"]
[null,"2032-09-13","s"]
[null,"2032-09-14","s"]
[null,"2032-09-15","s"]
[null,"2032-09-16","s"]
[null,"2032-09-17","s"]
[null,"2032-09-18","fds"]
[null,"2032-09-19","fds"]
[null,"2032-09-20","s"]
[null,"2032-09-21","s"]
[null,"2032-09-22","s"]
[null,"2032-09-23","s"]
[null,"2032-09-24","s"]
[null,"2032-09-25","fds"]
[null,"2032-09-26","fds"]
[null,"2032-09-27","s"]
[null,"2032-09-28","s"]
[null,"2032-09-29","s"]
[null,"2032-09-30","s"]
[null,"2032-10-01","s"]
[null,"2032-10-02","fds"]
[null,"2032-10-03","fds"]
[null,"2032-10-04","s"]
[null,"2032-10-05","s"]
[null,"2032-10-06","s"]
[null,"2032-10-07","s"]
[null,"2032-10-08","s"]
[null,"2032-10-09","fds"]
[null,"2032-10-10","fds"]
[null,"2032-10-11","s","oui"]
[null,"2032-10-12","s"]
[null,"2032-10-13","s"]
[null,"2032-10-14","s"]
[null,"2032-10-15","s"]
[null,"2032-10-16","fds"]
[null,"2032-10-17","fds"]
[null,"2032-10-18","s"]
[null,"2032-10-19","s"]
[null,"2032-10-20","s"]
[null,"2032-10-21","s"]
[null,"2032-10-22","s"]
[null,"2032-10-23","fds"]
[null,"2032-10-24","fds"]
[null,"2032-10-25","s"]
[null,"2032-10-26","s"]
[null,"2032-10-27","s"]
[null,"2032-10-28","s"]
[null,"2032-10-29","s"]
[null,"2032-10-30","fds"]
[null,"2032-10-31","fds"]
[null,"2032-11-01","s"]
[null,"2032-11-02","s"]
[null,"2032-11-03","s"]
[null,"2032-11-04","s"]
[null,"2032-11-05","s"]
[null,"2032-11-06","fds"]
[null,"2032-11-07","fds"]
[null,"2032-11-08","s"]
[null,"2032-11-09","s"]
[null,"2032-11-10","s"]
[null,"2032-11-11","s"]
[null,"2032-11-12","s"]
[null,"2032-11-13","fds"]
[null,"2032-11-14","fds"]
[null,"2032-11-15","s"]
[null,"2032-11-16","s"]
[null,"2032-11-17","s"]
[null,"2032-11-18","s"]
[null,"2032-11-19","s"]
[null,"2032-11-20","fds"]
[null,"2032-11-21","fds"]
[null,"2032-11-22","s"]
[null,"2032-11-23","s"]
[null,"2032-11-24","s"]
[null,"2032-11-25","s"]
[null,"2032-11-26","s"]
[null,"2032-11-27","fds"]
[null,"2032-11-28","fds"]
[null,"2032-11-29","s"]
[null,"2032-11-30","s"]
[null,"2032-12-01","s"]
[null,"2032-12-02","s"]
[null,"2032-12-03","s"]
[null,"2032-12-04","fds"]
[null,"2032-12-05","fds"]
[null,"2032-12-06","s"]
[null,"2032-12-07","s"]
[null,"2032-12-08","s"]
[null,"2032-12-09","s"]
[null,"2032-12-10","s"]
[null,"2032-12-11","fds"]
[null,"2032-12-12","fds"]
[null,"2032-12-13","s"]
[null,"2032-12-14","s"]
[null,"2032-12-15","s"]
[null,"2032-12-16","s"]
[null,"2032-12-17","s"]
[null,"2032-12-18","fds"]
[null,"2032-12-19","fds"]
[null,"2032-12-20","s"]
[null,"2032-12-21","s"]
[null,"2032-12-22","s"]
[null,"2032-12-23","s"]
[null,"2032-12-24","s","oui"]
[null,"2032-12-25","fds","oui"]
[null,"2032-12-26","fds","oui"]
[null,"2032-12-27","s"]
[null,"2032-12-28","s"]
[null,"2032-12-29","s"]
[null,"2032-12-30","s"]
[null,"2032-12-31","s","oui"]
[null,"2033-01-01","fds","oui"]
[null,"2033-01-02","fds","oui"]
[null,"2033-01-03","s"]
[null,"2033-01-04","s"]
[null,"2033-01-05","s"]
[null,"2033-01-06","s"]
[null,"2033-01-07","s"]
[null,"2033-01-08","fds"]
[null,"2033-01-09","fds"]
[null,"2033-01-10","s"]
[null,"2033-01-11","s"]
[null,"2033-01-12","s"]
[null,"2033-01-13","s"]
[null,"2033-01-14","s"]
[null,"2033-01-15","fds"]
[null,"2033-01-16","fds"]
[null,"2033-01-17","s"]
[null,"2033-01-18","s"]
[null,"2033-01-19","s"]
[null,"2033-01-20","s"]
[null,"2033-01-21","s"]
[null,"2033-01-22","fds"]
[null,"2033-01-23","fds"]
[null,"2033-01-24","s"]
[null,"2033-01-25","s"]
[null,"2033-01-26","s"]
[null,"2033-01-27","s"]
[null,"2033-01-28","s"]
[null,"2033-01-29","fds"]
[null,"2033-01-30","fds"]
[null,"2033-01-31","s"]
[null,"2033-02-01","s"]
[null,"2033-02-02","s"]
[null,"2033-02-03","s"]
[null,"2033-02-04","s"]
[null,"2033-02-05","fds"]
[null,"2033-02-06","fds"]
[null,"2033-02-07","s"]
[null,"2033-02-08","s"]
[null,"2033-02-09","s"]
[null,"2033-02-10","s"]
[null,"2033-02-11","s"]
[null,"2033-02-12","fds"]
[null,"2033-02-13","fds"]
[null,"2033-02-14","s"]
[null,"2033-02-15","s"]
[null,"2033-02-16","s"]
[null,"2033-02-17","s"]
[null,"2033-02-18","s"]
[null,"2033-02-19","fds"]
[null,"2033-02-20","fds"]
[null,"2033-02-21","s"]
[null,"2033-02-22","s"]
[null,"2033-02-23","s"]
[null,"2033-02-24","s"]
[null,"2033-02-25","s"]
[null,"2033-02-26","fds"]
[null,"2033-02-27","fds"]
[null,"2033-02-28","s"]
[null,"2033-03-01","s"]
[null,"2033-03-02","s"]
[null,"2033-03-03","s"]
[null,"2033-03-04","s"]
[null,"2033-03-05","fds"]
[null,"2033-03-06","fds"]
[null,"2033-03-07","s"]
[null,"2033-03-08","s"]
[null,"2033-03-09","s"]
[null,"2033-03-10","s"]
[null,"2033-03-11","s"]
[null,"2033-03-12","fds"]
[null,"2033-03-13","fds"]
[null,"2033-03-14","s"]
[null,"2033-03-15","s"]
[null,"2033-03-16","s"]
[null,"2033-03-17","s"]
[null,"2033-03-18","s"]
[null,"2033-03-19","fds"]
[null,"2033-03-20","fds"]
[null,"2033-03-21","s"]
[null,"2033-03-22","s"]
[null,"2033-03-23","s"]
[null,"2033-03-24","s"]
[null,"2033-03-25","s"]
[null,"2033-03-26","fds"]
[null,"2033-03-27","fds"]
[null,"2033-03-28","s"]
[null,"2033-03-29","s"]
[null,"2033-03-30","s"]
[null,"2033-03-31","s"]
[null,"2033-04-01","s"]
[null,"2033-04-02","fds"]
[null,"2033-04-03","fds"]
[null,"2033-04-04","s"]
[null,"2033-04-05","s"]
[null,"2033-04-06","s"]
[null,"2033-04-07","s"]
[null,"2033-04-08","s"]
[null,"2033-04-09","fds"]
[null,"2033-04-10","fds"]
[null,"2033-04-11","s"]
[null,"2033-04-12","s"]
[null,"2033-04-13","s"]
[null,"2033-04-14","s"]
[null,"2033-04-15","s","oui"]
[null,"2033-04-16","fds"]
[null,"2033-04-17","fds"]
[null,"2033-04-18","s","oui"]
[null,"2033-04-19","s"]
[null,"2033-04-20","s"]
[null,"2033-04-21","s"]
[null,"2033-04-22","s"]
[null,"2033-04-23","fds"]
[null,"2033-04-24","fds"]
[null,"2033-04-25","s"]
[null,"2033-04-26","s"]
[null,"2033-04-27","s"]
[null,"2033-04-28","s"]
[null,"2033-04-29","s"]
[null,"2033-04-30","fds"]
[null,"2033-05-01","fds"]
[null,"2033-05-02","s"]
[null,"2033-05-03","s"]
[null,"2033-05-04","s"]
[null,"2033-05-05","s"]
[null,"2033-05-06","s"]
[null,"2033-05-07","fds"]
[null,"2033-05-08","fds"]
[null,"2033-05-09","s"]
[null,"2033-05-10","s"]
[null,"2033-05-11","s"]
[null,"2033-05-12","s"]
[null,"2033-05-13","s"]
[null,"2033-05-14","fds"]
[null,"2033-05-15","fds"]
[null,"2033-05-16","s"]
[null,"2033-05-17","s"]
[null,"2033-05-18","s"]
[null,"2033-05-19","s"]
[null,"2033-05-20","s"]
[null,"2033-05-21","fds"]
[null,"2033-05-22","fds"]
[null,"2033-05-23","s","oui"]
[null,"2033-05-24","s"]
[null,"2033-05-25","s"]
[null,"2033-05-26","s"]
[null,"2033-05-27","s"]
[null,"2033-05-28","fds"]
[null,"2033-05-29","fds"]
[null,"2033-05-30","s"]
[null,"2033-05-31","s"]
[null,"2033-06-01","s"]
[null,"2033-06-02","s"]
[null,"2033-06-03","s"]
[null,"2033-06-04","fds"]
[null,"2033-06-05","fds"]
[null,"2033-06-06","s"]
[null,"2033-06-07","s"]
[null,"2033-06-08","s"]
[null,"2033-06-09","s"]
[null,"2033-06-10","s"]
[null,"2033-06-11","fds"]
[null,"2033-06-12","fds"]
[null,"2033-06-13","s"]
[null,"2033-06-14","s"]
[null,"2033-06-15","s"]
[null,"2033-06-16","s"]
[null,"2033-06-17","s"]
[null,"2033-06-18","fds"]
[null,"2033-06-19","fds"]
[null,"2033-06-20","s"]
[null,"2033-06-21","s"]
[null,"2033-06-22","s"]
[null,"2033-06-23","s"]
[null,"2033-06-24","s","oui"]
[null,"2033-06-25","fds"]
[null,"2033-06-26","fds"]
[null,"2033-06-27","s"]
[null,"2033-06-28","s"]
[null,"2033-06-29","s"]
[null,"2033-06-30","s"]
[null,"2033-07-01","s","oui"]
[null,"2033-07-02","fds"]
[null,"2033-07-03","fds"]
[null,"2033-07-04","s"]
[null,"2033-07-05","s"]
[null,"2033-07-06","s"]
[null,"2033-07-07","s"]
[null,"2033-07-08","s"]
[null,"2033-07-09","fds"]
[null,"2033-07-10","fds"]
[null,"2033-07-11","s"]
[null,"2033-07-12","s"]
[null,"2033-07-13","s"]
[null,"2033-07-14","s"]
[null,"2033-07-15","s"]
[null,"2033-07-16","fds"]
[null,"2033-07-17","fds"]
[null,"2033-07-18","s"]
[null,"2033-07-19","s"]
[null,"2033-07-20","s"]
[null,"2033-07-21","s"]
[null,"2033-07-22","s"]
[null,"2033-07-23","fds"]
[null,"2033-07-24","fds"]
[null,"2033-07-25","s"]
[null,"2033-07-26","s"]
[null,"2033-07-27","s"]
[null,"2033-07-28","s"]
[null,"2033-07-29","s"]
[null,"2033-07-30","fds"]
[null,"2033-07-31","fds"]
[null,"2033-08-01","s"]
[null,"2033-08-02","s"]
[null,"2033-08-03","s"]
[null,"2033-08-04","s"]
[null,"2033-08-05","s"]
[null,"2033-08-06","fds"]
[null,"2033-08-07","fds"]
[null,"2033-08-08","s"]
[null,"2033-08-09","s"]
[null,"2033-08-10","s"]
[null,"2033-08-11","s"]
[null,"2033-08-12","s"]
[null,"2033-08-13","fds"]
[null,"2033-08-14","fds"]
[null,"2033-08-15","s"]
[null,"2033-08-16","s"]
[null,"2033-08-17","s"]
[null,"2033-08-18","s"]
[null,"2033-08-19","s"]
[null,"2033-08-20","fds"]
[null,"2033-08-21","fds"]
[null,"2033-08-22","s"]
[null,"2033-08-23","s"]
[null,"2033-08-24","s"]
[null,"2033-08-25","s"]
[null,"2033-08-26","s"]
[null,"2033-08-27","fds"]
[null,"2033-08-28","fds"]
[null,"2033-08-29","s"]
[null,"2033-08-30","s"]
[null,"2033-08-31","s"]
[null,"2033-09-01","s"]
[null,"2033-09-02","s"]
[null,"2033-09-03","fds"]
[null,"2033-09-04","fds"]
[null,"2033-09-05","s","oui"]
[null,"2033-09-06","s"]
[null,"2033-09-07","s"]
[null,"2033-09-08","s"]
[null,"2033-09-09","s"]
[null,"2033-09-10","fds"]
[null,"2033-09-11","fds"]
[null,"2033-09-12","s"]
[null,"2033-09-13","s"]
[null,"2033-09-14","s"]
[null,"2033-09-15","s"]
[null,"2033-09-16","s"]
[null,"2033-09-17","fds"]
[null,"2033-09-18","fds"]
[null,"2033-09-19","s"]
[null,"2033-09-20","s"]
[null,"2033-09-21","s"]
[null,"2033-09-22","s"]
[null,"2033-09-23","s"]
[null,"2033-09-24","fds"]
[null,"2033-09-25","fds"]
[null,"2033-09-26","s"]
[null,"2033-09-27","s"]
[null,"2033-09-28","s"]
[null,"2033-09-29","s"]
[null,"2033-09-30","s"]
[null,"2033-10-01","fds"]
[null,"2033-10-02","fds"]
[null,"2033-10-03","s"]
[null,"2033-10-04","s"]
[null,"2033-10-05","s"]
[null,"2033-10-06","s"]
[null,"2033-10-07","s"]
[null,"2033-10-08","fds"]
[null,"2033-10-09","fds"]
[null,"2033-10-10","s","oui"]
[null,"2033-10-11","s"]
[null,"2033-10-12","s"]
[null,"2033-10-13","s"]
[null,"2033-10-14","s"]
[null,"2033-10-15","fds"]
[null,"2033-10-16","fds"]
[null,"2033-10-17","s"]
[null,"2033-10-18","s"]
[null,"2033-10-19","s"]
[null,"2033-10-20","s"]
[null,"2033-10-21","s"]
[null,"2033-10-22","fds"]
[null,"2033-10-23","fds"]
[null,"2033-10-24","s"]
[null,"2033-10-25","s"]
[null,"2033-10-26","s"]
[null,"2033-10-27","s"]
[null,"2033-10-28","s"]
[null,"2033-10-29","fds"]
[null,"2033-10-30","fds"]
[null,"2033-10-31","s"]
[null,"2033-11-01","s"]
[null,"2033-11-02","s"]
[null,"2033-11-03","s"]
[null,"2033-11-04","s"]
[null,"2033-11-05","fds"]
[null,"2033-11-06","fds"]
[null,"2033-11-07","s"]
[null,"2033-11-08","s"]
[null,"2033-11-09","s"]
[null,"2033-11-10","s"]
[null,"2033-11-11","s"]
[null,"2033-11-12","fds"]
[null,"2033-11-13","fds"]
[null,"2033-11-14","s"]
[null,"2033-11-15","s"]
[null,"2033-11-16","s"]
[null,"2033-11-17","s"]
[null,"2033-11-18","s"]
[null,"2033-11-19","fds"]
[null,"2033-11-20","fds"]
[null,"2033-11-21","s"]
[null,"2033-11-22","s"]
[null,"2033-11-23","s"]
[null,"2033-11-24","s"]
[null,"2033-11-25","s"]
[null,"2033-11-26","fds"]
[null,"2033-11-27","fds"]
[null,"2033-11-28","s"]
[null,"2033-11-29","s"]
[null,"2033-11-30","s"]
[null,"2033-12-01","s"]
[null,"2033-12-02","s"]
[null,"2033-12-03","fds"]
[null,"2033-12-04","fds"]
[null,"2033-12-05","s"]
[null,"2033-12-06","s"]
[null,"2033-12-07","s"]
[null,"2033-12-08","s"]
[null,"2033-12-09","s"]
[null,"2033-12-10","fds"]
[null,"2033-12-11","fds"]
[null,"2033-12-12","s"]
[null,"2033-12-13","s"]
[null,"2033-12-14","s"]
[null,"2033-12-15","s"]
[null,"2033-12-16","s"]
[null,"2033-12-17","fds"]
[null,"2033-12-18","fds"]
[null,"2033-12-19","s"]
[null,"2033-12-20","s"]
[null,"2033-12-21","s"]
[null,"2033-12-22","s"]
[null,"2033-12-23","s"]
[null,"2033-12-24","fds","oui"]
[null,"2033-12-25","fds","oui"]
[null,"2033-12-26","s","oui"]
[null,"2033-12-27","s"]
[null,"2033-12-28","s"]
[null,"2033-12-29","s"]
[null,"2033-12-30","s"]
[null,"2033-12-31","fds","oui"]
[null,"2034-01-01","fds","oui"]
[null,"2034-01-02","s","oui"]
[null,"2034-01-03","s"]
[null,"2034-01-04","s"]
[null,"2034-01-05","s"]
[null,"2034-01-06","s"]
[null,"2034-01-07","fds"]
[null,"2034-01-08","fds"]
[null,"2034-01-09","s"]
[null,"2034-01-10","s"]
[null,"2034-01-11","s"]
[null,"2034-01-12","s"]
[null,"2034-01-13","s"]
[null,"2034-01-14","fds"]
[null,"2034-01-15","fds"]
[null,"2034-01-16","s"]
[null,"2034-01-17","s"]
[null,"2034-01-18","s"]
[null,"2034-01-19","s"]
[null,"2034-01-20","s"]
[null,"2034-01-21","fds"]
[null,"2034-01-22","fds"]
[null,"2034-01-23","s"]
[null,"2034-01-24","s"]
[null,"2034-01-25","s"]
[null,"2034-01-26","s"]
[null,"2034-01-27","s"]
[null,"2034-01-28","fds"]
[null,"2034-01-29","fds"]
[null,"2034-01-30","s"]
[null,"2034-01-31","s"]
[null,"2034-02-01","s"]
[null,"2034-02-02","s"]
[null,"2034-02-03","s"]
[null,"2034-02-04","fds"]
[null,"2034-02-05","fds"]
[null,"2034-02-06","s"]
[null,"2034-02-07","s"]
[null,"2034-02-08","s"]
[null,"2034-02-09","s"]
[null,"2034-02-10","s"]
[null,"2034-02-11","fds"]
[null,"2034-02-12","fds"]
[null,"2034-02-13","s"]
[null,"2034-02-14","s"]
[null,"2034-02-15","s"]
[null,"2034-02-16","s"]
[null,"2034-02-17","s"]
[null,"2034-02-18","fds"]
[null,"2034-02-19","fds"]
[null,"2034-02-20","s"]
[null,"2034-02-21","s"]
[null,"2034-02-22","s"]
[null,"2034-02-23","s"]
[null,"2034-02-24","s"]
[null,"2034-02-25","fds"]
[null,"2034-02-26","fds"]
[null,"2034-02-27","s"]
[null,"2034-02-28","s"]
[null,"2034-03-01","s"]
[null,"2034-03-02","s"]
[null,"2034-03-03","s"]
[null,"2034-03-04","fds"]
[null,"2034-03-05","fds"]
[null,"2034-03-06","s"]
[null,"2034-03-07","s"]
[null,"2034-03-08","s"]
[null,"2034-03-09","s"]
[null,"2034-03-10","s"]
[null,"2034-03-11","fds"]
[null,"2034-03-12","fds"]
[null,"2034-03-13","s"]
[null,"2034-03-14","s"]
[null,"2034-03-15","s"]
[null,"2034-03-16","s"]
[null,"2034-03-17","s"]
[null,"2034-03-18","fds"]
[null,"2034-03-19","fds"]
[null,"2034-03-20","s"]
[null,"2034-03-21","s"]
[null,"2034-03-22","s"]
[null,"2034-03-23","s"]
[null,"2034-03-24","s"]
[null,"2034-03-25","fds"]
[null,"2034-03-26","fds"]
[null,"2034-03-27","s"]
[null,"2034-03-28","s"]
[null,"2034-03-29","s"]
[null,"2034-03-30","s"]
[null,"2034-03-31","s"]
[null,"2034-04-01","fds"]
[null,"2034-04-02","fds"]
[null,"2034-04-03","s"]
[null,"2034-04-04","s"]
[null,"2034-04-05","s"]
[null,"2034-04-06","s"]
[null,"2034-04-07","s","oui"]
[null,"2034-04-08","fds"]
[null,"2034-04-09","fds"]
[null,"2034-04-10","s","oui"]
[null,"2034-04-11","s"]
[null,"2034-04-12","s"]
[null,"2034-04-13","s"]
[null,"2034-04-14","s"]
[null,"2034-04-15","fds"]
[null,"2034-04-16","fds"]
[null,"2034-04-17","s"]
[null,"2034-04-18","s"]
[null,"2034-04-19","s"]
[null,"2034-04-20","s"]
[null,"2034-04-21","s"]
[null,"2034-04-22","fds"]
[null,"2034-04-23","fds"]
[null,"2034-04-24","s"]
[null,"2034-04-25","s"]
[null,"2034-04-26","s"]
[null,"2034-04-27","s"]
[null,"2034-04-28","s"]
[null,"2034-04-29","fds"]
[null,"2034-04-30","fds"]
[null,"2034-05-01","s"]
[null,"2034-05-02","s"]
[null,"2034-05-03","s"]
[null,"2034-05-04","s"]
[null,"2034-05-05","s"]
[null,"2034-05-06","fds"]
[null,"2034-05-07","fds"]
[null,"2034-05-08","s"]
[null,"2034-05-09","s"]
[null,"2034-05-10","s"]
[null,"2034-05-11","s"]
[null,"2034-05-12","s"]
[null,"2034-05-13","fds"]
[null,"2034-05-14","fds"]
[null,"2034-05-15","s"]
[null,"2034-05-16","s"]
[null,"2034-05-17","s"]
[null,"2034-05-18","s"]
[null,"2034-05-19","s"]
[null,"2034-05-20","fds"]
[null,"2034-05-21","fds"]
[null,"2034-05-22","s","oui"]
[null,"2034-05-23","s"]
[null,"2034-05-24","s"]
[null,"2034-05-25","s"]
[null,"2034-05-26","s"]
[null,"2034-05-27","fds"]
[null,"2034-05-28","fds"]
[null,"2034-05-29","s"]
[null,"2034-05-30","s"]
[null,"2034-05-31","s"]
[null,"2034-06-01","s"]
[null,"2034-06-02","s"]
[null,"2034-06-03","fds"]
[null,"2034-06-04","fds"]
[null,"2034-06-05","s"]
[null,"2034-06-06","s"]
[null,"2034-06-07","s"]
[null,"2034-06-08","s"]
[null,"2034-06-09","s"]
[null,"2034-06-10","fds"]
[null,"2034-06-11","fds"]
[null,"2034-06-12","s"]
[null,"2034-06-13","s"]
[null,"2034-06-14","s"]
[null,"2034-06-15","s"]
[null,"2034-06-16","s"]
[null,"2034-06-17","fds"]
[null,"2034-06-18","fds"]
[null,"2034-06-19","s"]
[null,"2034-06-20","s"]
[null,"2034-06-21","s"]
[null,"2034-06-22","s"]
[null,"2034-06-23","s"]
[null,"2034-06-24","fds","oui"]
[null,"2034-06-25","fds"]
[null,"2034-06-26","s"]
[null,"2034-06-27","s"]
[null,"2034-06-28","s"]
[null,"2034-06-29","s"]
[null,"2034-06-30","s"]
[null,"2034-07-01","fds","oui"]
[null,"2034-07-02","fds"]
[null,"2034-07-03","s"]
[null,"2034-07-04","s"]
[null,"2034-07-05","s"]
[null,"2034-07-06","s"]
[null,"2034-07-07","s"]
[null,"2034-07-08","fds"]
[null,"2034-07-09","fds"]
[null,"2034-07-10","s"]
[null,"2034-07-11","s"]
[null,"2034-07-12","s"]
[null,"2034-07-13","s"]
[null,"2034-07-14","s"]
[null,"2034-07-15","fds"]
[null,"2034-07-16","fds"]
[null,"2034-07-17","s"]
[null,"2034-07-18","s"]
[null,"2034-07-19","s"]
[null,"2034-07-20","s"]
[null,"2034-07-21","s"]
[null,"2034-07-22","fds"]
[null,"2034-07-23","fds"]
[null,"2034-07-24","s"]
[null,"2034-07-25","s"]
[null,"2034-07-26","s"]
[null,"2034-07-27","s"]
[null,"2034-07-28","s"]
[null,"2034-07-29","fds"]
[null,"2034-07-30","fds"]
[null,"2034-07-31","s"]
[null,"2034-08-01","s"]
[null,"2034-08-02","s"]
[null,"2034-08-03","s"]
[null,"2034-08-04","s"]
[null,"2034-08-05","fds"]
[null,"2034-08-06","fds"]
[null,"2034-08-07","s"]
[null,"2034-08-08","s"]
[null,"2034-08-09","s"]
[null,"2034-08-10","s"]
[null,"2034-08-11","s"]
[null,"2034-08-12","fds"]
[null,"2034-08-13","fds"]
[null,"2034-08-14","s"]
[null,"2034-08-15","s"]
[null,"2034-08-16","s"]
[null,"2034-08-17","s"]
[null,"2034-08-18","s"]
[null,"2034-08-19","fds"]
[null,"2034-08-20","fds"]
[null,"2034-08-21","s"]
[null,"2034-08-22","s"]
[null,"2034-08-23","s"]
[null,"2034-08-24","s"]
[null,"2034-08-25","s"]
[null,"2034-08-26","fds"]
[null,"2034-08-27","fds"]
[null,"2034-08-28","s"]
[null,"2034-08-29","s"]
[null,"2034-08-30","s"]
[null,"2034-08-31","s"]
[null,"2034-09-01","s"]
[null,"2034-09-02","fds"]
[null,"2034-09-03","fds"]
[null,"2034-09-04","s","oui"]
[null,"2034-09-05","s"]
[null,"2034-09-06","s"]
[null,"2034-09-07","s"]
[null,"2034-09-08","s"]
[null,"2034-09-09","fds"]
[null,"2034-09-10","fds"]
[null,"2034-09-11","s"]
[null,"2034-09-12","s"]
[null,"2034-09-13","s"]
[null,"2034-09-14","s"]
[null,"2034-09-15","s"]
[null,"2034-09-16","fds"]
[null,"2034-09-17","fds"]
[null,"2034-09-18","s"]
[null,"2034-09-19","s"]
[null,"2034-09-20","s"]
[null,"2034-09-21","s"]
[null,"2034-09-22","s"]
[null,"2034-09-23","fds"]
[null,"2034-09-24","fds"]
[null,"2034-09-25","s"]
[null,"2034-09-26","s"]
[null,"2034-09-27","s"]
[null,"2034-09-28","s"]
[null,"2034-09-29","s"]
[null,"2034-09-30","fds"]
[null,"2034-10-01","fds"]
[null,"2034-10-02","s"]
[null,"2034-10-03","s"]
[null,"2034-10-04","s"]
[null,"2034-10-05","s"]
[null,"2034-10-06","s"]
[null,"2034-10-07","fds"]
[null,"2034-10-08","fds"]
[null,"2034-10-09","s","oui"]
[null,"2034-10-10","s"]
[null,"2034-10-11","s"]
[null,"2034-10-12","s"]
[null,"2034-10-13","s"]
[null,"2034-10-14","fds"]
[null,"2034-10-15","fds"]
[null,"2034-10-16","s"]
[null,"2034-10-17","s"]
[null,"2034-10-18","s"]
[null,"2034-10-19","s"]
[null,"2034-10-20","s"]
[null,"2034-10-21","fds"]
[null,"2034-10-22","fds"]
[null,"2034-10-23","s"]
[null,"2034-10-24","s"]
[null,"2034-10-25","s"]
[null,"2034-10-26","s"]
[null,"2034-10-27","s"]
[null,"2034-10-28","fds"]
[null,"2034-10-29","fds"]
[null,"2034-10-30","s"]
[null,"2034-10-31","s"]
[null,"2034-11-01","s"]
[null,"2034-11-02","s"]
[null,"2034-11-03","s"]
[null,"2034-11-04","fds"]
[null,"2034-11-05","fds"]
[null,"2034-11-06","s"]
[null,"2034-11-07","s"]
[null,"2034-11-08","s"]
[null,"2034-11-09","s"]
[null,"2034-11-10","s"]
[null,"2034-11-11","fds"]
[null,"2034-11-12","fds"]
[null,"2034-11-13","s"]
[null,"2034-11-14","s"]
[null,"2034-11-15","s"]
[null,"2034-11-16","s"]
[null,"2034-11-17","s"]
[null,"2034-11-18","fds"]
[null,"2034-11-19","fds"]
[null,"2034-11-20","s"]
[null,"2034-11-21","s"]
[null,"2034-11-22","s"]
[null,"2034-11-23","s"]
[null,"2034-11-24","s"]
[null,"2034-11-25","fds"]
[null,"2034-11-26","fds"]
[null,"2034-11-27","s"]
[null,"2034-11-28","s"]
[null,"2034-11-29","s"]
[null,"2034-11-30","s"]
[null,"2034-12-01","s"]
[null,"2034-12-02","fds"]
[null,"2034-12-03","fds"]
[null,"2034-12-04","s"]
[null,"2034-12-05","s"]
[null,"2034-12-06","s"]
[null,"2034-12-07","s"]
[null,"2034-12-08","s"]
[null,"2034-12-09","fds"]
[null,"2034-12-10","fds"]
[null,"2034-12-11","s"]
[null,"2034-12-12","s"]
[null,"2034-12-13","s"]
[null,"2034-12-14","s"]
[null,"2034-12-15","s"]
[null,"2034-12-16","fds"]
[null,"2034-12-17","fds"]
[null,"2034-12-18","s"]
[null,"2034-12-19","s"]
[null,"2034-12-20","s"]
[null,"2034-12-21","s"]
[null,"2034-12-22","s"]
[null,"2034-12-23","fds"]
[null,"2034-12-24","fds","oui"]
[null,"2034-12-25","s","oui"]
[null,"2034-12-26","s","oui"]
[null,"2034-12-27","s"]
[null,"2034-12-28","s"]
[null,"2034-12-29","s"]
[null,"2034-12-30","fds"]
[null,"2034-12-31","fds","oui"]
[null,"2035-01-01","s","oui"]
[null,"2035-01-02","s","oui"]
[null,"2035-01-03","s"]
[null,"2035-01-04","s"]
[null,"2035-01-05","s"]
[null,"2035-01-06","fds"]
[null,"2035-01-07","fds"]
[null,"2035-01-08","s"]
[null,"2035-01-09","s"]
[null,"2035-01-10","s"]
[null,"2035-01-11","s"]
[null,"2035-01-12","s"]
[null,"2035-01-13","fds"]
[null,"2035-01-14","fds"]
[null,"2035-01-15","s"]
[null,"2035-01-16","s"]
[null,"2035-01-17","s"]
[null,"2035-01-18","s"]
[null,"2035-01-19","s"]
[null,"2035-01-20","fds"]
[null,"2035-01-21","fds"]
[null,"2035-01-22","s"]
[null,"2035-01-23","s"]
[null,"2035-01-24","s"]
[null,"2035-01-25","s"]
[null,"2035-01-26","s"]
[null,"2035-01-27","fds"]
[null,"2035-01-28","fds"]
[null,"2035-01-29","s"]
[null,"2035-01-30","s"]
[null,"2035-01-31","s"]
[null,"2035-02-01","s"]
[null,"2035-02-02","s"]
[null,"2035-02-03","fds"]
[null,"2035-02-04","fds"]
[null,"2035-02-05","s"]
[null,"2035-02-06","s"]
[null,"2035-02-07","s"]
[null,"2035-02-08","s"]
[null,"2035-02-09","s"]
[null,"2035-02-10","fds"]
[null,"2035-02-11","fds"]
[null,"2035-02-12","s"]
[null,"2035-02-13","s"]
[null,"2035-02-14","s"]
[null,"2035-02-15","s"]
[null,"2035-02-16","s"]
[null,"2035-02-17","fds"]
[null,"2035-02-18","fds"]
[null,"2035-02-19","s"]
[null,"2035-02-20","s"]
[null,"2035-02-21","s"]
[null,"2035-02-22","s"]
[null,"2035-02-23","s"]
[null,"2035-02-24","fds"]
[null,"2035-02-25","fds"]
[null,"2035-02-26","s"]
[null,"2035-02-27","s"]
[null,"2035-02-28","s"]
[null,"2035-03-01","s"]
[null,"2035-03-02","s"]
[null,"2035-03-03","fds"]
[null,"2035-03-04","fds"]
[null,"2035-03-05","s"]
[null,"2035-03-06","s"]
[null,"2035-03-07","s"]
[null,"2035-03-08","s"]
[null,"2035-03-09","s"]
[null,"2035-03-10","fds"]
[null,"2035-03-11","fds"]
[null,"2035-03-12","s"]
[null,"2035-03-13","s"]
[null,"2035-03-14","s"]
[null,"2035-03-15","s"]
[null,"2035-03-16","s"]
[null,"2035-03-17","fds"]
[null,"2035-03-18","fds"]
[null,"2035-03-19","s"]
[null,"2035-03-20","s"]
[null,"2035-03-21","s"]
[null,"2035-03-22","s"]
[null,"2035-03-23","s","oui"]
[null,"2035-03-24","fds"]
[null,"2035-03-25","fds"]
[null,"2035-03-26","s","oui"]
[null,"2035-03-27","s"]
[null,"2035-03-28","s"]
[null,"2035-03-29","s"]
[null,"2035-03-30","s"]
[null,"2035-03-31","fds"]
[null,"2035-04-01","fds"]
[null,"2035-04-02","s"]
[null,"2035-04-03","s"]
[null,"2035-04-04","s"]
[null,"2035-04-05","s"]
[null,"2035-04-06","s"]
[null,"2035-04-07","fds"]
[null,"2035-04-08","fds"]
[null,"2035-04-09","s"]
[null,"2035-04-10","s"]
[null,"2035-04-11","s"]
[null,"2035-04-12","s"]
[null,"2035-04-13","s"]
[null,"2035-04-14","fds"]
[null,"2035-04-15","fds"]
[null,"2035-04-16","s"]
[null,"2035-04-17","s"]
[null,"2035-04-18","s"]
[null,"2035-04-19","s"]
[null,"2035-04-20","s"]
[null,"2035-04-21","fds"]
[null,"2035-04-22","fds"]
[null,"2035-04-23","s"]
[null,"2035-04-24","s"]
[null,"2035-04-25","s"]
[null,"2035-04-26","s"]
[null,"2035-04-27","s"]
[null,"2035-04-28","fds"]
[null,"2035-04-29","fds"]
[null,"2035-04-30","s"]
[null,"2035-05-01","s"]
[null,"2035-05-02","s"]
[null,"2035-05-03","s"]
[null,"2035-05-04","s"]
[null,"2035-05-05","fds"]
[null,"2035-05-06","fds"]
[null,"2035-05-07","s"]
[null,"2035-05-08","s"]
[null,"2035-05-09","s"]
[null,"2035-05-10","s"]
[null,"2035-05-11","s"]
[null,"2035-05-12","fds"]
[null,"2035-05-13","fds"]
[null,"2035-05-14","s"]
[null,"2035-05-15","s"]
[null,"2035-05-16","s"]
[null,"2035-05-17","s"]
[null,"2035-05-18","s"]
[null,"2035-05-19","fds"]
[null,"2035-05-20","fds"]
[null,"2035-05-21","s","oui"]
[null,"2035-05-22","s"]
[null,"2035-05-23","s"]
[null,"2035-05-24","s"]
[null,"2035-05-25","s"]
[null,"2035-05-26","fds"]
[null,"2035-05-27","fds"]
[null,"2035-05-28","s"]
[null,"2035-05-29","s"]
[null,"2035-05-30","s"]
[null,"2035-05-31","s"]
[null,"2035-06-01","s"]
[null,"2035-06-02","fds"]
[null,"2035-06-03","fds"]
[null,"2035-06-04","s"]
[null,"2035-06-05","s"]
[null,"2035-06-06","s"]
[null,"2035-06-07","s"]
[null,"2035-06-08","s"]
[null,"2035-06-09","fds"]
[null,"2035-06-10","fds"]
[null,"2035-06-11","s"]
[null,"2035-06-12","s"]
[null,"2035-06-13","s"]
[null,"2035-06-14","s"]
[null,"2035-06-15","s"]
[null,"2035-06-16","fds"]
[null,"2035-06-17","fds"]
[null,"2035-06-18","s"]
[null,"2035-06-19","s"]
[null,"2035-06-20","s"]
[null,"2035-06-21","s"]
[null,"2035-06-22","s"]
[null,"2035-06-23","fds"]
[null,"2035-06-24","fds","oui"]
[null,"2035-06-25","s"]
[null,"2035-06-26","s"]
[null,"2035-06-27","s"]
[null,"2035-06-28","s"]
[null,"2035-06-29","s"]
[null,"2035-06-30","fds"]
[null,"2035-07-01","fds","oui"]
[null,"2035-07-02","s"]
[null,"2035-07-03","s"]
[null,"2035-07-04","s"]
[null,"2035-07-05","s"]
[null,"2035-07-06","s"]
[null,"2035-07-07","fds"]
[null,"2035-07-08","fds"]
[null,"2035-07-09","s"]
[null,"2035-07-10","s"]
[null,"2035-07-11","s"]
[null,"2035-07-12","s"]
[null,"2035-07-13","s"]
[null,"2035-07-14","fds"]
[null,"2035-07-15","fds"]
[null,"2035-07-16","s"]
[null,"2035-07-17","s"]
[null,"2035-07-18","s"]
[null,"2035-07-19","s"]
[null,"2035-07-20","s"]
[null,"2035-07-21","fds"]
[null,"2035-07-22","fds"]
[null,"2035-07-23","s"]
[null,"2035-07-24","s"]
[null,"2035-07-25","s"]
[null,"2035-07-26","s"]
[null,"2035-07-27","s"]
[null,"2035-07-28","fds"]
[null,"2035-07-29","fds"]
[null,"2035-07-30","s"]
[null,"2035-07-31","s"]
[null,"2035-08-01","s"]
[null,"2035-08-02","s"]
[null,"2035-08-03","s"]
[null,"2035-08-04","fds"]
[null,"2035-08-05","fds"]
[null,"2035-08-06","s"]
[null,"2035-08-07","s"]
[null,"2035-08-08","s"]
[null,"2035-08-09","s"]
[null,"2035-08-10","s"]
[null,"2035-08-11","fds"]
[null,"2035-08-12","fds"]
[null,"2035-08-13","s"]
[null,"2035-08-14","s"]
[null,"2035-08-15","s"]
[null,"2035-08-16","s"]
[null,"2035-08-17","s"]
[null,"2035-08-18","fds"]
[null,"2035-08-19","fds"]
[null,"2035-08-20","s"]
[null,"2035-08-21","s"]
[null,"2035-08-22","s"]
[null,"2035-08-23","s"]
[null,"2035-08-24","s"]
[null,"2035-08-25","fds"]
[null,"2035-08-26","fds"]
[null,"2035-08-27","s"]
[null,"2035-08-28","s"]
[null,"2035-08-29","s"]
[null,"2035-08-30","s"]
[null,"2035-08-31","s"]
[null,"2035-09-01","fds"]
[null,"2035-09-02","fds"]
[null,"2035-09-03","s","oui"]
[null,"2035-09-04","s"]
[null,"2035-09-05","s"]
[null,"2035-09-06","s"]
[null,"2035-09-07","s"]
[null,"2035-09-08","fds"]
[null,"2035-09-09","fds"]
[null,"2035-09-10","s"]
[null,"2035-09-11","s"]
[null,"2035-09-12","s"]
[null,"2035-09-13","s"]
[null,"2035-09-14","s"]
[null,"2035-09-15","fds"]
[null,"2035-09-16","fds"]
[null,"2035-09-17","s"]
[null,"2035-09-18","s"]
[null,"2035-09-19","s"]
[null,"2035-09-20","s"]
[null,"2035-09-21","s"]
[null,"2035-09-22","fds"]
[null,"2035-09-23","fds"]
[null,"2035-09-24","s"]
[null,"2035-09-25","s"]
[null,"2035-09-26","s"]
[null,"2035-09-27","s"]
[null,"2035-09-28","s"]
[null,"2035-09-29","fds"]
[null,"2035-09-30","fds"]
[null,"2035-10-01","s"]
[null,"2035-10-02","s"]
[null,"2035-10-03","s"]
[null,"2035-10-04","s"]
[null,"2035-10-05","s"]
[null,"2035-10-06","fds"]
[null,"2035-10-07","fds"]
[null,"2035-10-08","s","oui"]
[null,"2035-10-09","s"]
[null,"2035-10-10","s"]
[null,"2035-10-11","s"]
[null,"2035-10-12","s"]
[null,"2035-10-13","fds"]
[null,"2035-10-14","fds"]
[null,"2035-10-15","s"]
[null,"2035-10-16","s"]
[null,"2035-10-17","s"]
[null,"2035-10-18","s"]
[null,"2035-10-19","s"]
[null,"2035-10-20","fds"]
[null,"2035-10-21","fds"]
[null,"2035-10-22","s"]
[null,"2035-10-23","s"]
[null,"2035-10-24","s"]
[null,"2035-10-25","s"]
[null,"2035-10-26","s"]
[null,"2035-10-27","fds"]
[null,"2035-10-28","fds"]
[null,"2035-10-29","s"]
[null,"2035-10-30","s"]
[null,"2035-10-31","s"]
[null,"2035-11-01","s"]
[null,"2035-11-02","s"]
[null,"2035-11-03","fds"]
[null,"2035-11-04","fds"]
[null,"2035-11-05","s"]
[null,"2035-11-06","s"]
[null,"2035-11-07","s"]
[null,"2035-11-08","s"]
[null,"2035-11-09","s"]
[null,"2035-11-10","fds"]
[null,"2035-11-11","fds"]
[null,"2035-11-12","s"]
[null,"2035-11-13","s"]
[null,"2035-11-14","s"]
[null,"2035-11-15","s"]
[null,"2035-11-16","s"]
[null,"2035-11-17","fds"]
[null,"2035-11-18","fds"]
[null,"2035-11-19","s"]
[null,"2035-11-20","s"]
[null,"2035-11-21","s"]
[null,"2035-11-22","s"]
[null,"2035-11-23","s"]
[null,"2035-11-24","fds"]
[null,"2035-11-25","fds"]
[null,"2035-11-26","s"]
[null,"2035-11-27","s"]
[null,"2035-11-28","s"]
[null,"2035-11-29","s"]
[null,"2035-11-30","s"]
[null,"2035-12-01","fds"]
[null,"2035-12-02","fds"]
[null,"2035-12-03","s"]
[null,"2035-12-04","s"]
[null,"2035-12-05","s"]
[null,"2035-12-06","s"]
[null,"2035-12-07","s"]
[null,"2035-12-08","fds"]
[null,"2035-12-09","fds"]
[null,"2035-12-10","s"]
[null,"2035-12-11","s"]
[null,"2035-12-12","s"]
[null,"2035-12-13","s"]
[null,"2035-12-14","s"]
[null,"2035-12-15","fds"]
[null,"2035-12-16","fds"]
[null,"2035-12-17","s"]
[null,"2035-12-18","s"]
[null,"2035-12-19","s"]
[null,"2035-12-20","s"]
[null,"2035-12-21","s"]
[null,"2035-12-22","fds"]
[null,"2035-12-23","fds"]
[null,"2035-12-24","s","oui"]
[null,"2035-12-25","s","oui"]
[null,"2035-12-26","s","oui"]
[null,"2035-12-27","s"]
[null,"2035-12-28","s"]
[null,"2035-12-29","fds"]
[null,"2035-12-30","fds"]
[null,"2035-12-31","s","oui"]
[null,"2036-01-01","s","oui"]
[null,"2036-01-02","s","oui"]
[null,"2036-01-03","s"]
[null,"2036-01-04","s"]
[null,"2036-01-05","fds"]
[null,"2036-01-06","fds"]
[null,"2036-01-07","s"]
[null,"2036-01-08","s"]
[null,"2036-01-09","s"]
[null,"2036-01-10","s"]
[null,"2036-01-11","s"]
[null,"2036-01-12","fds"]
[null,"2036-01-13","fds"]
[null,"2036-01-14","s"]
[null,"2036-01-15","s"]
[null,"2036-01-16","s"]
[null,"2036-01-17","s"]
[null,"2036-01-18","s"]
[null,"2036-01-19","fds"]
[null,"2036-01-20","fds"]
[null,"2036-01-21","s"]
[null,"2036-01-22","s"]
[null,"2036-01-23","s"]
[null,"2036-01-24","s"]
[null,"2036-01-25","s"]
[null,"2036-01-26","fds"]
[null,"2036-01-27","fds"]
[null,"2036-01-28","s"]
[null,"2036-01-29","s"]
[null,"2036-01-30","s"]
[null,"2036-01-31","s"]
[null,"2036-02-01","s"]
[null,"2036-02-02","fds"]
[null,"2036-02-03","fds"]
[null,"2036-02-04","s"]
[null,"2036-02-05","s"]
[null,"2036-02-06","s"]
[null,"2036-02-07","s"]
[null,"2036-02-08","s"]
[null,"2036-02-09","fds"]
[null,"2036-02-10","fds"]
[null,"2036-02-11","s"]
[null,"2036-02-12","s"]
[null,"2036-02-13","s"]
[null,"2036-02-14","s"]
[null,"2036-02-15","s"]
[null,"2036-02-16","fds"]
[null,"2036-02-17","fds"]
[null,"2036-02-18","s"]
[null,"2036-02-19","s"]
[null,"2036-02-20","s"]
[null,"2036-02-21","s"]
[null,"2036-02-22","s"]
[null,"2036-02-23","fds"]
[null,"2036-02-24","fds"]
[null,"2036-02-25","s"]
[null,"2036-02-26","s"]
[null,"2036-02-27","s"]
[null,"2036-02-28","s"]
[null,"2036-02-29","s"]
[null,"2036-03-01","fds"]
[null,"2036-03-02","fds"]
[null,"2036-03-03","s"]
[null,"2036-03-04","s"]
[null,"2036-03-05","s"]
[null,"2036-03-06","s"]
[null,"2036-03-07","s"]
[null,"2036-03-08","fds"]
[null,"2036-03-09","fds"]
[null,"2036-03-10","s"]
[null,"2036-03-11","s"]
[null,"2036-03-12","s"]
[null,"2036-03-13","s"]
[null,"2036-03-14","s"]
[null,"2036-03-15","fds"]
[null,"2036-03-16","fds"]
[null,"2036-03-17","s"]
[null,"2036-03-18","s"]
[null,"2036-03-19","s"]
[null,"2036-03-20","s"]
[null,"2036-03-21","s"]
[null,"2036-03-22","fds"]
[null,"2036-03-23","fds"]
[null,"2036-03-24","s"]
[null,"2036-03-25","s"]
[null,"2036-03-26","s"]
[null,"2036-03-27","s"]
[null,"2036-03-28","s"]
[null,"2036-03-29","fds"]
[null,"2036-03-30","fds"]
[null,"2036-03-31","s"]
[null,"2036-04-01","s"]
[null,"2036-04-02","s"]
[null,"2036-04-03","s"]
[null,"2036-04-04","s"]
[null,"2036-04-05","fds"]
[null,"2036-04-06","fds"]
[null,"2036-04-07","s"]
[null,"2036-04-08","s"]
[null,"2036-04-09","s"]
[null,"2036-04-10","s"]
[null,"2036-04-11","s","oui"]
[null,"2036-04-12","fds"]
[null,"2036-04-13","fds"]
[null,"2036-04-14","s","oui"]
[null,"2036-04-15","s"]
[null,"2036-04-16","s"]
[null,"2036-04-17","s"]
[null,"2036-04-18","s"]
[null,"2036-04-19","fds"]
[null,"2036-04-20","fds"]
[null,"2036-04-21","s"]
[null,"2036-04-22","s"]
[null,"2036-04-23","s"]
[null,"2036-04-24","s"]
[null,"2036-04-25","s"]
[null,"2036-04-26","fds"]
[null,"2036-04-27","fds"]
[null,"2036-04-28","s"]
[null,"2036-04-29","s"]
[null,"2036-04-30","s"]
[null,"2036-05-01","s"]
[null,"2036-05-02","s"]
[null,"2036-05-03","fds"]
[null,"2036-05-04","fds"]
[null,"2036-05-05","s"]
[null,"2036-05-06","s"]
[null,"2036-05-07","s"]
[null,"2036-05-08","s"]
[null,"2036-05-09","s"]
[null,"2036-05-10","fds"]
[null,"2036-05-11","fds"]
[null,"2036-05-12","s"]
[null,"2036-05-13","s"]
[null,"2036-05-14","s"]
[null,"2036-05-15","s"]
[null,"2036-05-16","s"]
[null,"2036-05-17","fds"]
[null,"2036-05-18","fds"]
[null,"2036-05-19","s","oui"]
[null,"2036-05-20","s"]
[null,"2036-05-21","s"]
[null,"2036-05-22","s"]
[null,"2036-05-23","s"]
[null,"2036-05-24","fds"]
[null,"2036-05-25","fds"]
[null,"2036-05-26","s"]
[null,"2036-05-27","s"]
[null,"2036-05-28","s"]
[null,"2036-05-29","s"]
[null,"2036-05-30","s"]
[null,"2036-05-31","fds"]
[null,"2036-06-01","fds"]
[null,"2036-06-02","s"]
[null,"2036-06-03","s"]
[null,"2036-06-04","s"]
[null,"2036-06-05","s"]
[null,"2036-06-06","s"]
[null,"2036-06-07","fds"]
[null,"2036-06-08","fds"]
[null,"2036-06-09","s"]
[null,"2036-06-10","s"]
[null,"2036-06-11","s"]
[null,"2036-06-12","s"]
[null,"2036-06-13","s"]
[null,"2036-06-14","fds"]
[null,"2036-06-15","fds"]
[null,"2036-06-16","s"]
[null,"2036-06-17","s"]
[null,"2036-06-18","s"]
[null,"2036-06-19","s"]
[null,"2036-06-20","s"]
[null,"2036-06-21","fds"]
[null,"2036-06-22","fds"]
[null,"2036-06-23","s"]
[null,"2036-06-24","s","oui"]
[null,"2036-06-25","s"]
[null,"2036-06-26","s"]
[null,"2036-06-27","s"]
[null,"2036-06-28","fds"]
[null,"2036-06-29","fds"]
[null,"2036-06-30","s"]
[null,"2036-07-01","s","oui"]
[null,"2036-07-02","s"]
[null,"2036-07-03","s"]
[null,"2036-07-04","s"]
[null,"2036-07-05","fds"]
[null,"2036-07-06","fds"]
[null,"2036-07-07","s"]
[null,"2036-07-08","s"]
[null,"2036-07-09","s"]
[null,"2036-07-10","s"]
[null,"2036-07-11","s"]
[null,"2036-07-12","fds"]
[null,"2036-07-13","fds"]
[null,"2036-07-14","s"]
[null,"2036-07-15","s"]
[null,"2036-07-16","s"]
[null,"2036-07-17","s"]
[null,"2036-07-18","s"]
[null,"2036-07-19","fds"]
[null,"2036-07-20","fds"]
[null,"2036-07-21","s"]
[null,"2036-07-22","s"]
[null,"2036-07-23","s"]
[null,"2036-07-24","s"]
[null,"2036-07-25","s"]
[null,"2036-07-26","fds"]
[null,"2036-07-27","fds"]
[null,"2036-07-28","s"]
[null,"2036-07-29","s"]
[null,"2036-07-30","s"]
[null,"2036-07-31","s"]
[null,"2036-08-01","s"]
[null,"2036-08-02","fds"]
[null,"2036-08-03","fds"]
[null,"2036-08-04","s"]
[null,"2036-08-05","s"]
[null,"2036-08-06","s"]
[null,"2036-08-07","s"]
[null,"2036-08-08","s"]
[null,"2036-08-09","fds"]
[null,"2036-08-10","fds"]
[null,"2036-08-11","s"]
[null,"2036-08-12","s"]
[null,"2036-08-13","s"]
[null,"2036-08-14","s"]
[null,"2036-08-15","s"]
[null,"2036-08-16","fds"]
[null,"2036-08-17","fds"]
[null,"2036-08-18","s"]
[null,"2036-08-19","s"]
[null,"2036-08-20","s"]
[null,"2036-08-21","s"]
[null,"2036-08-22","s"]
[null,"2036-08-23","fds"]
[null,"2036-08-24","fds"]
[null,"2036-08-25","s"]
[null,"2036-08-26","s"]
[null,"2036-08-27","s"]
[null,"2036-08-28","s"]
[null,"2036-08-29","s"]
[null,"2036-08-30","fds"]
[null,"2036-08-31","fds"]
[null,"2036-09-01","s","oui"]
[null,"2036-09-02","s"]
[null,"2036-09-03","s"]
[null,"2036-09-04","s"]
[null,"2036-09-05","s"]
[null,"2036-09-06","fds"]
[null,"2036-09-07","fds"]
[null,"2036-09-08","s"]
[null,"2036-09-09","s"]
[null,"2036-09-10","s"]
[null,"2036-09-11","s"]
[null,"2036-09-12","s"]
[null,"2036-09-13","fds"]
[null,"2036-09-14","fds"]
[null,"2036-09-15","s"]
[null,"2036-09-16","s"]
[null,"2036-09-17","s"]
[null,"2036-09-18","s"]
[null,"2036-09-19","s"]
[null,"2036-09-20","fds"]
[null,"2036-09-21","fds"]
[null,"2036-09-22","s"]
[null,"2036-09-23","s"]
[null,"2036-09-24","s"]
[null,"2036-09-25","s"]
[null,"2036-09-26","s"]
[null,"2036-09-27","fds"]
[null,"2036-09-28","fds"]
[null,"2036-09-29","s"]
[null,"2036-09-30","s"]
[null,"2036-10-01","s"]
[null,"2036-10-02","s"]
[null,"2036-10-03","s"]
[null,"2036-10-04","fds"]
[null,"2036-10-05","fds"]
[null,"2036-10-06","s"]
[null,"2036-10-07","s"]
[null,"2036-10-08","s"]
[null,"2036-10-09","s"]
[null,"2036-10-10","s"]
[null,"2036-10-11","fds"]
[null,"2036-10-12","fds"]
[null,"2036-10-13","s","oui"]
[null,"2036-10-14","s"]
[null,"2036-10-15","s"]
[null,"2036-10-16","s"]
[null,"2036-10-17","s"]
[null,"2036-10-18","fds"]
[null,"2036-10-19","fds"]
[null,"2036-10-20","s"]
[null,"2036-10-21","s"]
[null,"2036-10-22","s"]
[null,"2036-10-23","s"]
[null,"2036-10-24","s"]
[null,"2036-10-25","fds"]
[null,"2036-10-26","fds"]
[null,"2036-10-27","s"]
[null,"2036-10-28","s"]
[null,"2036-10-29","s"]
[null,"2036-10-30","s"]
[null,"2036-10-31","s"]
[null,"2036-11-01","fds"]
[null,"2036-11-02","fds"]
[null,"2036-11-03","s"]
[null,"2036-11-04","s"]
[null,"2036-11-05","s"]
[null,"2036-11-06","s"]
[null,"2036-11-07","s"]
[null,"2036-11-08","fds"]
[null,"2036-11-09","fds"]
[null,"2036-11-10","s"]
[null,"2036-11-11","s"]
[null,"2036-11-12","s"]
[null,"2036-11-13","s"]
[null,"2036-11-14","s"]
[null,"2036-11-15","fds"]
[null,"2036-11-16","fds"]
[null,"2036-11-17","s"]
[null,"2036-11-18","s"]
[null,"2036-11-19","s"]
[null,"2036-11-20","s"]
[null,"2036-11-21","s"]
[null,"2036-11-22","fds"]
[null,"2036-11-23","fds"]
[null,"2036-11-24","s"]
[null,"2036-11-25","s"]
[null,"2036-11-26","s"]
[null,"2036-11-27","s"]
[null,"2036-11-28","s"]
[null,"2036-11-29","fds"]
[null,"2036-11-30","fds"]
[null,"2036-12-01","s"]
[null,"2036-12-02","s"]
[null,"2036-12-03","s"]
[null,"2036-12-04","s"]
[null,"2036-12-05","s"]
[null,"2036-12-06","fds"]
[null,"2036-12-07","fds"]
[null,"2036-12-08","s"]
[null,"2036-12-09","s"]
[null,"2036-12-10","s"]
[null,"2036-12-11","s"]
[null,"2036-12-12","s"]
[null,"2036-12-13","fds"]
[null,"2036-12-14","fds"]
[null,"2036-12-15","s"]
[null,"2036-12-16","s"]
[null,"2036-12-17","s"]
[null,"2036-12-18","s"]
[null,"2036-12-19","s"]
[null,"2036-12-20","fds"]
[null,"2036-12-21","fds"]
[null,"2036-12-22","s"]
[null,"2036-12-23","s"]
[null,"2036-12-24","s","oui"]
[null,"2036-12-25","s","oui"]
[null,"2036-12-26","s","oui"]
[null,"2036-12-27","fds"]
[null,"2036-12-28","fds"]
[null,"2036-12-29","s"]
[null,"2036-12-30","s"]
[null,"2036-12-31","s","oui"]
[null,"2037-01-01","s","oui"]
[null,"2037-01-02","s","oui"]
[null,"2037-01-03","fds"]
[null,"2037-01-04","fds"]
[null,"2037-01-05","s"]
[null,"2037-01-06","s"]
[null,"2037-01-07","s"]
[null,"2037-01-08","s"]
[null,"2037-01-09","s"]
[null,"2037-01-10","fds"]
[null,"2037-01-11","fds"]
[null,"2037-01-12","s"]
[null,"2037-01-13","s"]
[null,"2037-01-14","s"]
[null,"2037-01-15","s"]
[null,"2037-01-16","s"]
[null,"2037-01-17","fds"]
[null,"2037-01-18","fds"]
[null,"2037-01-19","s"]
[null,"2037-01-20","s"]
[null,"2037-01-21","s"]
[null,"2037-01-22","s"]
[null,"2037-01-23","s"]
[null,"2037-01-24","fds"]
[null,"2037-01-25","fds"]
[null,"2037-01-26","s"]
[null,"2037-01-27","s"]
[null,"2037-01-28","s"]
[null,"2037-01-29","s"]
[null,"2037-01-30","s"]
[null,"2037-01-31","fds"]
[null,"2037-02-01","fds"]
[null,"2037-02-02","s"]
[null,"2037-02-03","s"]
[null,"2037-02-04","s"]
[null,"2037-02-05","s"]
[null,"2037-02-06","s"]
[null,"2037-02-07","fds"]
[null,"2037-02-08","fds"]
[null,"2037-02-09","s"]
[null,"2037-02-10","s"]
[null,"2037-02-11","s"]
[null,"2037-02-12","s"]
[null,"2037-02-13","s"]
[null,"2037-02-14","fds"]
[null,"2037-02-15","fds"]
[null,"2037-02-16","s"]
[null,"2037-02-17","s"]
[null,"2037-02-18","s"]
[null,"2037-02-19","s"]
[null,"2037-02-20","s"]
[null,"2037-02-21","fds"]
[null,"2037-02-22","fds"]
[null,"2037-02-23","s"]
[null,"2037-02-24","s"]
[null,"2037-02-25","s"]
[null,"2037-02-26","s"]
[null,"2037-02-27","s"]
[null,"2037-02-28","fds"]
[null,"2037-03-01","fds"]
[null,"2037-03-02","s"]
[null,"2037-03-03","s"]
[null,"2037-03-04","s"]
[null,"2037-03-05","s"]
[null,"2037-03-06","s"]
[null,"2037-03-07","fds"]
[null,"2037-03-08","fds"]
[null,"2037-03-09","s"]
[null,"2037-03-10","s"]
[null,"2037-03-11","s"]
[null,"2037-03-12","s"]
[null,"2037-03-13","s"]
[null,"2037-03-14","fds"]
[null,"2037-03-15","fds"]
[null,"2037-03-16","s"]
[null,"2037-03-17","s"]
[null,"2037-03-18","s"]
[null,"2037-03-19","s"]
[null,"2037-03-20","s"]
[null,"2037-03-21","fds"]
[null,"2037-03-22","fds"]
[null,"2037-03-23","s"]
[null,"2037-03-24","s"]
[null,"2037-03-25","s"]
[null,"2037-03-26","s"]
[null,"2037-03-27","s"]
[null,"2037-03-28","fds"]
[null,"2037-03-29","fds"]
[null,"2037-03-30","s"]
[null,"2037-03-31","s"]
[null,"2037-04-01","s"]
[null,"2037-04-02","s"]
[null,"2037-04-03","s","oui"]
[null,"2037-04-04","fds"]
[null,"2037-04-05","fds"]
[null,"2037-04-06","s","oui"]
[null,"2037-04-07","s"]
[null,"2037-04-08","s"]
[null,"2037-04-09","s"]
[null,"2037-04-10","s"]
[null,"2037-04-11","fds"]
[null,"2037-04-12","fds"]
[null,"2037-04-13","s"]
[null,"2037-04-14","s"]
[null,"2037-04-15","s"]
[null,"2037-04-16","s"]
[null,"2037-04-17","s"]
[null,"2037-04-18","fds"]
[null,"2037-04-19","fds"]
[null,"2037-04-20","s"]
[null,"2037-04-21","s"]
[null,"2037-04-22","s"]
[null,"2037-04-23","s"]
[null,"2037-04-24","s"]
[null,"2037-04-25","fds"]
[null,"2037-04-26","fds"]
[null,"2037-04-27","s"]
[null,"2037-04-28","s"]
[null,"2037-04-29","s"]
[null,"2037-04-30","s"]
[null,"2037-05-01","s"]
[null,"2037-05-02","fds"]
[null,"2037-05-03","fds"]
[null,"2037-05-04","s"]
[null,"2037-05-05","s"]
[null,"2037-05-06","s"]
[null,"2037-05-07","s"]
[null,"2037-05-08","s"]
[null,"2037-05-09","fds"]
[null,"2037-05-10","fds"]
[null,"2037-05-11","s"]
[null,"2037-05-12","s"]
[null,"2037-05-13","s"]
[null,"2037-05-14","s"]
[null,"2037-05-15","s"]
[null,"2037-05-16","fds"]
[null,"2037-05-17","fds"]
[null,"2037-05-18","s","oui"]
[null,"2037-05-19","s"]
[null,"2037-05-20","s"]
[null,"2037-05-21","s"]
[null,"2037-05-22","s"]
[null,"2037-05-23","fds"]
[null,"2037-05-24","fds"]
[null,"2037-05-25","s"]
[null,"2037-05-26","s"]
[null,"2037-05-27","s"]
[null,"2037-05-28","s"]
[null,"2037-05-29","s"]
[null,"2037-05-30","fds"]
[null,"2037-05-31","fds"]
[null,"2037-06-01","s"]
[null,"2037-06-02","s"]
[null,"2037-06-03","s"]
[null,"2037-06-04","s"]
[null,"2037-06-05","s"]
[null,"2037-06-06","fds"]
[null,"2037-06-07","fds"]
[null,"2037-06-08","s"]
[null,"2037-06-09","s"]
[null,"2037-06-10","s"]
[null,"2037-06-11","s"]
[null,"2037-06-12","s"]
[null,"2037-06-13","fds"]
[null,"2037-06-14","fds"]
[null,"2037-06-15","s"]
[null,"2037-06-16","s"]
[null,"2037-06-17","s"]
[null,"2037-06-18","s"]
[null,"2037-06-19","s"]
[null,"2037-06-20","fds"]
[null,"2037-06-21","fds"]
[null,"2037-06-22","s"]
[null,"2037-06-23","s"]
[null,"2037-06-24","s","oui"]
[null,"2037-06-25","s"]
[null,"2037-06-26","s"]
[null,"2037-06-27","fds"]
[null,"2037-06-28","fds"]
[null,"2037-06-29","s"]
[null,"2037-06-30","s"]
[null,"2037-07-01","s","oui"]
[null,"2037-07-02","s"]
[null,"2037-07-03","s"]
[null,"2037-07-04","fds"]
[null,"2037-07-05","fds"]
[null,"2037-07-06","s"]
[null,"2037-07-07","s"]
[null,"2037-07-08","s"]
[null,"2037-07-09","s"]
[null,"2037-07-10","s"]
[null,"2037-07-11","fds"]
[null,"2037-07-12","fds"]
[null,"2037-07-13","s"]
[null,"2037-07-14","s"]
[null,"2037-07-15","s"]
[null,"2037-07-16","s"]
[null,"2037-07-17","s"]
[null,"2037-07-18","fds"]
[null,"2037-07-19","fds"]
[null,"2037-07-20","s"]
[null,"2037-07-21","s"]
[null,"2037-07-22","s"]
[null,"2037-07-23","s"]
[null,"2037-07-24","s"]
[null,"2037-07-25","fds"]
[null,"2037-07-26","fds"]
[null,"2037-07-27","s"]
[null,"2037-07-28","s"]
[null,"2037-07-29","s"]
[null,"2037-07-30","s"]
[null,"2037-07-31","s"]
[null,"2037-08-01","fds"]
[null,"2037-08-02","fds"]
[null,"2037-08-03","s"]
[null,"2037-08-04","s"]
[null,"2037-08-05","s"]
[null,"2037-08-06","s"]
[null,"2037-08-07","s"]
[null,"2037-08-08","fds"]
[null,"2037-08-09","fds"]
[null,"2037-08-10","s"]
[null,"2037-08-11","s"]
[null,"2037-08-12","s"]
[null,"2037-08-13","s"]
[null,"2037-08-14","s"]
[null,"2037-08-15","fds"]
[null,"2037-08-16","fds"]
[null,"2037-08-17","s"]
[null,"2037-08-18","s"]
[null,"2037-08-19","s"]
[null,"2037-08-20","s"]
[null,"2037-08-21","s"]
[null,"2037-08-22","fds"]
[null,"2037-08-23","fds"]
[null,"2037-08-24","s"]
[null,"2037-08-25","s"]
[null,"2037-08-26","s"]
[null,"2037-08-27","s"]
[null,"2037-08-28","s"]
[null,"2037-08-29","fds"]
[null,"2037-08-30","fds"]
[null,"2037-08-31","s"]
[null,"2037-09-01","s"]
[null,"2037-09-02","s"]
[null,"2037-09-03","s"]
[null,"2037-09-04","s"]
[null,"2037-09-05","fds"]
[null,"2037-09-06","fds"]
[null,"2037-09-07","s","oui"]
[null,"2037-09-08","s"]
[null,"2037-09-09","s"]
[null,"2037-09-10","s"]
[null,"2037-09-11","s"]
[null,"2037-09-12","fds"]
[null,"2037-09-13","fds"]
[null,"2037-09-14","s"]
[null,"2037-09-15","s"]
[null,"2037-09-16","s"]
[null,"2037-09-17","s"]
[null,"2037-09-18","s"]
[null,"2037-09-19","fds"]
[null,"2037-09-20","fds"]
[null,"2037-09-21","s"]
[null,"2037-09-22","s"]
[null,"2037-09-23","s"]
[null,"2037-09-24","s"]
[null,"2037-09-25","s"]
[null,"2037-09-26","fds"]
[null,"2037-09-27","fds"]
[null,"2037-09-28","s"]
[null,"2037-09-29","s"]
[null,"2037-09-30","s"]
[null,"2037-10-01","s"]
[null,"2037-10-02","s"]
[null,"2037-10-03","fds"]
[null,"2037-10-04","fds"]
[null,"2037-10-05","s"]
[null,"2037-10-06","s"]
[null,"2037-10-07","s"]
[null,"2037-10-08","s"]
[null,"2037-10-09","s"]
[null,"2037-10-10","fds"]
[null,"2037-10-11","fds"]
[null,"2037-10-12","s","oui"]
[null,"2037-10-13","s"]
[null,"2037-10-14","s"]
[null,"2037-10-15","s"]
[null,"2037-10-16","s"]
[null,"2037-10-17","fds"]
[null,"2037-10-18","fds"]
[null,"2037-10-19","s"]
[null,"2037-10-20","s"]
[null,"2037-10-21","s"]
[null,"2037-10-22","s"]
[null,"2037-10-23","s"]
[null,"2037-10-24","fds"]
[null,"2037-10-25","fds"]
[null,"2037-10-26","s"]
[null,"2037-10-27","s"]
[null,"2037-10-28","s"]
[null,"2037-10-29","s"]
[null,"2037-10-30","s"]
[null,"2037-10-31","fds"]
[null,"2037-11-01","fds"]
[null,"2037-11-02","s"]
[null,"2037-11-03","s"]
[null,"2037-11-04","s"]
[null,"2037-11-05","s"]
[null,"2037-11-06","s"]
[null,"2037-11-07","fds"]
[null,"2037-11-08","fds"]
[null,"2037-11-09","s"]
[null,"2037-11-10","s"]
[null,"2037-11-11","s"]
[null,"2037-11-12","s"]
[null,"2037-11-13","s"]
[null,"2037-11-14","fds"]
[null,"2037-11-15","fds"]
[null,"2037-11-16","s"]
[null,"2037-11-17","s"]
[null,"2037-11-18","s"]
[null,"2037-11-19","s"]
[null,"2037-11-20","s"]
[null,"2037-11-21","fds"]
[null,"2037-11-22","fds"]
[null,"2037-11-23","s"]
[null,"2037-11-24","s"]
[null,"2037-11-25","s"]
[null,"2037-11-26","s"]
[null,"2037-11-27","s"]
[null,"2037-11-28","fds"]
[null,"2037-11-29","fds"]
[null,"2037-11-30","s"]
[null,"2037-12-01","s"]
[null,"2037-12-02","s"]
[null,"2037-12-03","s"]
[null,"2037-12-04","s"]
[null,"2037-12-05","fds"]
[null,"2037-12-06","fds"]
[null,"2037-12-07","s"]
[null,"2037-12-08","s"]
[null,"2037-12-09","s"]
[null,"2037-12-10","s"]
[null,"2037-12-11","s"]
[null,"2037-12-12","fds"]
[null,"2037-12-13","fds"]
[null,"2037-12-14","s"]
[null,"2037-12-15","s"]
[null,"2037-12-16","s"]
[null,"2037-12-17","s"]
[null,"2037-12-18","s"]
[null,"2037-12-19","fds"]
[null,"2037-12-20","fds"]
[null,"2037-12-21","s"]
[null,"2037-12-22","s"]
[null,"2037-12-23","s"]
[null,"2037-12-24","s","oui"]
[null,"2037-12-25","s","oui"]
[null,"2037-12-26","fds","oui"]
[null,"2037-12-27","fds"]
[null,"2037-12-28","s"]
[null,"2037-12-29","s"]
[null,"2037-12-30","s"]
[null,"2037-12-31","s","oui"]

{"sheet":"TAUX","index":17,"n_rows":81,"n_cols":8,"rows_kept":81,"cut":false,"hidden":true,"merged":[[46,2,46,3],[45,6,45,7],[46,6,46,7]]}
[]
[null,"champs à modifier avec les nouveaux tarifs",2026]
[]
[null,"Attente"]
[]
[null,"Semaine - jour/soir  ",29.25]
[null,"Semaine - nuit  ",36.25]
[null,"Fin semaine - jour/soir  ",32.5]
[null,"Fin semaine - nuit  ",39.25]
[null,"Fériés - jour/soir  ",40.75]
[null,"Fériés - nuit  ",49]
[]
[null,"Base ailleurs qu'à Québec et Montréal"]
[]
[null,"Semaine - jour/soir  ",184]
[null,"Semaine - nuit  ",220]
[null,"Fin semaine - jour/soir  ",198]
[null,"Fin semaine - nuit  ",242]
[null,"Fériés - jour/soir  ",244]
[null,"Fériés - nuit  ",288]
[]
[null,"Base Montréal et Québec"]
[]
[null,"Semaine - jour/soir  ",184]
[null,"Semaine - nuit  ",220]
[null,"Fin semaine - jour/soir  ",198]
[null,"Fin semaine - nuit  ",242]
[null,"Fériés - jour/soir  ",244]
[null,"Fériés - nuit  ",288]
[]
[null,"Kilométrage"]
[null,"Chemin public",1.8]
[null,"Chemin non public",3.3]
[]
[null,"Divers frais"]
[null,"Frais de garde",67]
[null,"Frais de visite",67]
[null,"Nettoyage supplémentaire",45.75]
[null,"Corps additionnel",125]
[]
[null,"Repas","Maximum","incluant le pourboire",null,"Maximum sans les taxes"]
[null,"Déjeuner",14.95,null,null,13]
[null,"Dîner",20.6,null,null,17.899999999999999]
[null,"Souper",31.1,null,null,27]
[]
[null,null,null,null,null,null,"Indemnité journalière"]
[null,null,"Tarifs = indemnités journalières",null,null,null,0.5]
[null,"Nuitées","Basse","Haute",null,null,"Basse","Haute"]
[null,null,"basse saison","haute saison",null,null,"basse saison","haute saison"]
[null,"Montréal",219,235,null,"Montréal",{"$f":"ROUND(C50/2,2)","v":109.5},{"$f":"ROUND(D50/2,2)","v":117.5}]
[null,"Québec",193,193,null,"Québec",96.5,96.5]
[null,"Laval",188,198,null,"Laval",94,99]
[null,"Gatineau",188,198,null,"Gatineau",94,99]
[null,"Longueuil",188,198,null,"Longueuil",94,99]
[null,"Lac-Beauport",188,198,null,"Lac-Beauport",94,99]
[null,"Lac-Delage",188,198,null,"Lac-Delage",94,99]
[null,"Rimouski",164,169,null,"Rimouski",82,84.5]
[null,"Ailleurs",164,169,null,"Ailleurs",82,84.5]
[null,null,"Tarifs excluant la taxe sur l'hébergement"]
[]
[null,"TPS",{"$f":"ROUND(D61,5)","v":0.05},0.05]
[null,"TVQ",{"$f":"ROUND(D62,5)","v":9.9750000000000005E-2},9.9750000000000005E-2]
[null,"total à titre indicatif seulement",{"$f":"SUM(C61:C62)","v":0.14974999999999999},{"$f":"D61+D62","v":0.14974999999999999}]
[]
[]
[null,"Lieux de transport"]
[null,null,"Installations du transporteur"]
[null,null,"Morgue Montréal"]
[null,null,"Morgue Québec"]
[null,null,"Hôpital"]
[null,null,"Résidence privée"]
[null,null,"CHSLD / centre jeunesse"]
[null,null,"Prison / pénitencier"]
[null,null,"Autre"]
[]
[]
[]
[null,"Liste pour stationnement"]
[null,null,"oui"]
[null,null,"non"]
[null,null,"ne sait pas"]

{"sheet":"Calculs repas","index":18,"n_rows":24,"n_cols":8,"rows_kept":24,"cut":false,"hidden":true,"merged":[]}
[]
[null,null,null,null,"REPAS"]
[]
[]
[null,null,null,"Déjeuner",null,"Dîner",null,"Souper"]
[]
[null,null,null,{"$f":"TAUX!F42","v":13},null,{"$f":"TAUX!F43","v":17.899999999999999},null,{"$f":"TAUX!F44","v":27}]
[null,"TPS",{"$f":"ROUND(D7*TAUX!$C$61,2)","v":0.65},null,{"$f":"F7*TAUX!$C$61","v":0.89500000000000002},null,{"$f":"ROUND(H7*TAUX!$C$61,3)","v":1.35}]
[null,"TVQ",{"$f":"ROUND(D7*TAUX!$C$62,2)","v":1.3},null,{"$f":"F7*TAUX!$C$62","v":1.785525},null,{"$f":"ROUND(H7*TAUX!$C$62,2)","v":2.69}]
[null,"total taxes",null,{"$f":"ROUND(C8+C9,10)","v":1.95},null,{"$f":"E8+E9","v":2.6805250000000003},null,{"$f":"ROUNDUP(G8+G9,2)","v":4.04}]
[null,"pourboire"]
[null,"maximum admissible",null,{"$f":"SUM(D7:D11)","v":14.95},null,{"$f":"SUM(F7:F11)","v":20.580524999999998},null,{"$f":"ROUND(SUM(H7:H11),2)","v":31.04}]
[]
[]
[null,null,null,"J'AI JOUÉ AVEC LES ARRONDIS POUR QUE LES TOUS LES MONTANTS S'ADDITIONNENT BIEN"]
[]
[]
[]
[]
[null,"ATTENTION:"]
[]
["NE RIEN MODIFIER DANS CE TABLEAU."]
["TOUS LES CALCULS SONT AUTOMATIQUES EN FONCTION DES DONNÉES INSCRITES DANS L'ONGLET TAUX."]
["SI CHANGEMENT DE MONTANT ADMISSIBLE OU DES TAUX DE TPS OU DE TVQ, FAIRE LES MODIFICATIONS DANS ONGLET TAUX"]